{"text_format":"1","workbook":"xlsx","n_sheets":11,"sheets":["Intro","Invoeren","Resultaten","Vergelijken","Methodiek","A. Breakdown","B. Lijsten","C. Warmtetechnieken","D. Handelingsperspectief","E. GemeenteData","Toelichting"],"not_rendered":{"charts":0,"images":8,"macros":1,"external_links":0,"defined_names":5,"comments":2,"pivot_tables":0},"unopened":[],"bounds":{"document_bytes":16777216,"sheet_cells":100000,"rows_first":2000,"rows_last":500,"rows_between":2000,"halvings":0,"cell_chars":16384,"cell_head_chars":4096},"cells_cut":0,"cells_raw":0,"read":"whole","date_system":"1900"}

{"sheet":"Intro","index":0,"n_rows":23,"n_cols":5,"rows_kept":23,"cut":false,"hidden":false,"merged":[[5,4,6,4],[1,1,2,1]]}
[]
[null,{"$error":"#VALUE!"},"Het Warmtekeuze model",null,{"$error":"#VALUE!"}]
[null,null,"Het keuze model voor kleine kernen",null,{"$error":"#VALUE!"}]
[null,null,"Aanleiding"]
[null,null,"Deze tool omvat het Warmte Keuze Model, dat inzicht geeft in mogelijke warmtesytemen. Op dit moment ligt de nadruk bij de onderzoeken binnen de warmtetransitie op de kansen van (grootschalig) collectieve systemen in stededelijk gebied. Het onderzoeken van warmteoplossingen buiten stedelijk gebied heeft doorgaans een lagere prioriteit. Hier wordt typisch ingezet op individuele oplossingen. Warmteoplossingen op basis van individuele elektrische warmtebronnen worden echter minder kansrijk door de toenemende netcongestie en energieprijzen. Hierdoor wordt de noodzaak voor collectieve warmteoplossingen (waar mogelijk) buiten stedelijk gebied steeds groter. ",null,"Belangrijk!"]
[null,null,null,null,"Sta het gebruik van marco's in de excel toe"]
[null,null,"Het Warmtekeuze Model (WKM) is ontwikkeld om gemeenten te ondersteunen bij het - op termijn - aardgasvrij maken van kleinere gemeenschappen en dorpen (ook wel kleine kernen). Gemeenten kunnen het WKM invullen met de kenmerken van het te onderzoeken gebied. Dit kan een heel dorp of cbs-buurt zijn, maar ook een specifieke wijk, straat of groep huizen binnen de cbs-buurt of kern. Het WKM maakt op basis van de ingevulde informatie inzichtelijk welke warmteoplossingen mogelijk kunnen passen. Dit is een voorkeursrichting op basis van de techniek. \n\nVervolgens kan de gemeente in het blad \"Vergelijken\" de warmteoplossing in meer detail bekijken en geeft het model inzicht in welke consequenties hiermee gepaard gaan en hoe een warmteoplossing zich verhoudt met de andere oplossingen. Op basis hiervan kan de gemeente afwegen welke warmteoplossingen interessant kunnen zijn om nader te verkennen. Let op: De resultaten uit het WKM zijn bedoeld als richtinggevend. Het betekent dus niet dat de warmteoplossingen die uit het model komen, per definitie de meest passende oplossingen zijn. Keuzes binnen de warmtetransitie vragen om maatwerk en moeten gemaakt worden op basis van technische, financiële en maatschappelijke waarden en afwegingen. Het WKM kan louter gebruikt worden om een denkrichting te bepalen en geeft suggesties welke oplossingsrichtingen voor de desbetreffende kern verder in detail uitgezocht kunnen worden. "]
[]
[null,null,"Aan de slag met het model"]
[]
[null,null,"·         Stap 1: Neem een kleine kern of deelgebied in gedachten en klik op de knop hiernaast ( \"Klik hier om te starten\" om te beginnen."]
[null,null,"·         Stap 2: Vul de vragenlijst van boven naar beneden in. Op basis van de gegeven antwoorden komen er aanvullende vragen naar voren."]
[null,null,"o   Als gemeente ken je de lokale situatie waarschijnlijk het beste. Vul het formulier op basis van lokale kennis in."]
[null,null,"o   Indien er zaken niet bekend zijn, is er onder de knop “Extra informatie” een terugvaloptie beschikbaar. Hierbij wordt per vraag verwezen naar een relevante externe landelijke databron of een databestand."]
[]
[null,null,"·         Stap 3: Nadat alle vragen beantwoord zijn, klik op de knop <Resultaten>"]
[null,null,"o   In een nieuw tabblad verschijnt de top 10 kansrijke warmteoplossingen, inclusief een korte beschrijving van het systeem."]
[null,null,"·         Stap 4: Door te klikken op de knop <Vergelijken> opent een nieuw tabblad waarin de oplossingen in meer detail vergeleken kunnen."]
[null,null,"o   Met de selectievelden boven in beeld kunnen twee warmteoplossingen naast elkaar gepresenteerd worden. De 10 meest kansrijke oplossingen zijn te selecteren."]
[null,null,"o   Op verschillende onderdelen zijn de verschillende warmtesystemen met elkaar te vergelijken"]
[null,null,"·         Stap 5: Bepaal de interessante warmteoplossing(en) om nader te onderzoeken. Je kunt hier voor zelf een onderzoek opstarten of verder advies vragen aan adviesbureaus of het Expertteam Warmte Gelderland. "]
[]
[null,null,"Het Warmtekeuze model is door Haskoning ontwikkeld in opdracht van de provincie Gelderland."]

{"sheet":"Invoeren","index":1,"n_rows":39,"n_cols":13,"rows_kept":39,"cut":false,"hidden":false,"merged":[[4,6,5,6],[0,1,1,1],[38,1,39,6],[37,1,37,2],[14,2,14,4],[3,3,3,4],[12,2,12,3],[2,0,3,1],[25,2,25,4],[13,2,13,4],[10,2,10,4],[5,2,5,4],[30,2,30,4],[19,2,19,4],[20,2,20,4],[12,10,12,12],[14,10,23,12],[36,8,36,9],[34,2,34,4],[32,2,32,3],[27,2,27,3],[28,2,28,3],[26,2,26,3],[31,2,31,3],[33,2,33,3]]}
[null,{"$error":"#VALUE!"},"Het Warmtekeuze model",null,null,null,null,null,null,{"$error":"#VALUE!"}]
[null,null,"Het keuze model voor kleine kernen",null,null,null,null,null,null,{"$error":"#VALUE!"}]
[null,null,null,null,null,null,null,null,null,null,"EXTRA INFORMATIE"]
[null,null,"Naam van de kern of deelgebied",null,null,null,"INVULLEN"]
[null,null,null,null,null,null,"↓",null,null,null,"Check of voor de gemeente informatie beschikbaar is:"]
[null,1,"Basisvragen",null,null,null,null,null,null,null,"Indien de kern ontbreekt  kan de PBL startanalyse wordt gebruikt",null,"PBL Startanalyse 2025"]
[null,"a","Zijn de energielabels van de kern bekend?"]
[null,"b","Welk energielabel is meest aanwezig?",null,null,null,null,null,null,null,"Meest voorkomende energielabel (2025)",null,{"$f":"IF(M5=\"\",\"\",VLOOKUP(M5,'E. GemeenteData'!A:AE,5,FALSE))","v":""}]
[null,"c","Welk bouwjaar is het meest voorkomend?",null,null,null,null,null,null,null,"Meest voorkomende bouwjaar (2025)",null,{"$f":"IF(M5=\"\",\"\",VLOOKUP(M5,'E. GemeenteData'!A:AE,15,FALSE))","v":""}]
[]
[null,2,"Warmtevraagdichtheid",null,null,null,null,null,null,null,"Geschatte warmtevraagdichtheid",null,{"$f":"IF(M5=\"\",\"\",VLOOKUP(M5,'E. GemeenteData'!A:AE,31,FALSE))","v":""}]
[null,"a","Wat is de warmtevraagdichtheid?",null,null,null,null,null,null,null,"Definitie warmtevraag dichtheid"]
[null,null,null,null,null,null,null,null,null,null,"De warmtevraagdichtheid is enerzijds afhankelijk van de gebouwdichtheid (hoeveel gebouwen per m2) en anderzijds van de warmtevraag per gebouw (een slecht geïsoleerd en groot huis heeft doorgaans een hogere warmtevraag). De onderverdeling is als volgt:\n\n- Laag: <100.000 (denk aan goedgeïsoleerde, vrijstaande woningen zoals villawijken of landelijk gebied)\n- Middenlaag: 100.000-150.0000 (denk aan landelijk gebied met veel vrijstaande huizen, die minder goed geisoleerd zijn en twee-onder-een-kapswoningen)\n- Midden: 150.000-250.000 (denk aan gebieden met rijtjeshuizen, twee-onder-een-kapswoningen en kleine appartementencomplexen.)\n- Middenhoog: 250.000-500.000 (denk aan voorstedelijke gebieden met rijtjeshuizen, appartementencomplexen en gemengde woon-werkgebieden.)\n- Hoog: 500.000 (denk aan stedelijke gebieden met hoogbouw, appartementencomplexen en commerciële gebouwen dicht bij elkaar.)"]
[null,3,"Warmtebron"]
[null,"a","Is er een potentiele warmtebron beschikbaar in de buurt van de kern?",null,null,null,null,null,null,null,"PBL Startanalyse 2025"]
[null,null,null,"Geothermie"]
[null,null,null,"Datathermie"]
[null,null,null,"Restwarmte"]
[null,null,null,"Aquathermie"]
[null,"b","Welke temperatuurniveau heeft deze restwarmtebron?"]
[null,"c","Welke type aquathermie is beschikbaar?"]
[null,null,null,"TEO (oppervlaktewater)"]
[null,null,null,"TEA (afvalwater)"]
[null,null,null,"TED (drinkwater)"]
[]
[null,4,"Belemmerende kenmerken"]
[null,"a","Is er sprake van netcongestie?",null,null,null,null,null,null,null,"Capaciteitskaart elektriciteitsnet"]
[null,"b","Bevindt de locatie zich in waterwinningsgebied?",null,null,null,null,null,null,null,"Warmteatlas - WWG"]
[null,"c","Bevindt de locatie zich in natura2000 gebied?",null,null,null,null,null,null,null,"Warmteatlas - Natura 2000"]
[]
[null,5,"Nabije kernen"]
[null,"a","Hoeveel woningen (WEQ) kunnen bij deze kern worden aangesloten?",null,null,null,null,null,null,null,"PBL Startanalyse 2025"]
[null,"b","Wat voor type kern is het?"]
[null,"c","Zijn er andere kernen in de buurt, waarmee samenwerking mogelijk is?"]
[null,"d","Hoeveel woningen (WEQ) kunnen met alle kernen gezamenlijk worden aangesloten?"]
[]
[]
[null,"TIPS BIJ PROBLEMEN"]
[null,"1. Open Excel in de desktop app, niet in de browser\n2. Zet macro's aan\n3. Alle vragen op het formulier dienen te worden ingevuld\n"]

{"sheet":"Resultaten","index":2,"n_rows":24,"n_cols":11,"rows_kept":24,"cut":false,"hidden":false,"merged":[[10,8,11,10],[12,8,13,10],[2,4,2,6],[27,6,27,8],[14,8,15,10],[16,8,17,10],[18,8,19,10],[20,8,21,10],[22,8,23,10],[8,1,9,1],[1,4,1,8],[3,8,3,10],[4,8,5,10],[6,8,7,10],[8,8,9,10],[22,1,23,1],[20,3,21,3],[4,3,5,3],[4,6,5,6],[4,1,5,1],[6,3,7,3],[6,1,7,1],[6,6,7,6],[18,1,19,1],[8,3,9,3],[10,3,11,3],[12,3,13,3],[14,3,15,3],[16,3,17,3],[12,1,13,1],[10,1,11,1],[20,1,21,1],[18,3,19,3],[1,1,2,2],[25,6,26,7],[25,8,26,8],[8,6,9,6],[10,6,11,6],[12,6,13,6],[14,6,15,6],[16,6,17,6],[18,6,19,6],[20,6,21,6],[22,6,23,6],[16,1,17,1],[14,1,15,1],[22,3,23,3]]}
[]
[null,{"$error":"#VALUE!"},null,null,"Het Warmtekeuze model",null,null,null,null,null,{"$error":"#VALUE!"}]
[null,null,null,null,"Resultaten",null,null,null,null,null,{"$error":"#VALUE!"}]
[null,"Top",null,null,"Warmtetechniek",null,"Score",null,"Toelichting"]
[null,1,null,{"$f":"'A. Breakdown'!I3","v":""},{"$f":"(IF(D5=\"\",\"\",VLOOKUP(D5,'A. Breakdown'!E:G,2,FALSE)))","v":""},null,{"$f":"'A. Breakdown'!H3","v":""},null,{"$f":"IF('A. Breakdown'!I3=\"\",\"\",VLOOKUP('A. Breakdown'!I3,'D. Handelingsperspectief'!D:N,2,FALSE))","v":""}]
[null,null,null,null,{"$f":"IF(D5=\"\",\"\",VLOOKUP(D5,'A. Breakdown'!E:G,3,FALSE))","v":""}]
[null,2,null,{"$f":"'A. Breakdown'!I4","v":""},{"$f":"(IF(D7=\"\",\"\",VLOOKUP(D7,'A. Breakdown'!E:G,2,FALSE)))","v":""},null,{"$f":"'A. Breakdown'!H4","v":""},null,{"$f":"IF('A. Breakdown'!I4=\"\",\"\",VLOOKUP('A. Breakdown'!I4,'D. Handelingsperspectief'!D:N,2,FALSE))","v":""}]
[null,null,null,null,{"$f":"IF(D7=\"\",\"\",VLOOKUP(D7,'A. Breakdown'!E:G,3,FALSE))","v":""}]
[null,3,null,{"$f":"'A. Breakdown'!I5","v":""},{"$f":"(IF(D9=\"\",\"\",VLOOKUP(D9,'A. Breakdown'!E:G,2,FALSE)))","v":""},null,{"$f":"'A. Breakdown'!H5","v":""},null,{"$f":"IF('A. Breakdown'!I5=\"\",\"\",VLOOKUP('A. Breakdown'!I5,'D. Handelingsperspectief'!D:N,2,FALSE))","v":""}]
[null,null,null,null,{"$f":"IF(D9=\"\",\"\",VLOOKUP(D9,'A. Breakdown'!E:G,3,FALSE))","v":""}]
[null,4,null,{"$f":"'A. Breakdown'!I6","v":""},{"$f":"(IF(D11=\"\",\"\",VLOOKUP(D11,'A. Breakdown'!E:G,2,FALSE)))","v":""},null,{"$f":"'A. Breakdown'!H6","v":""},null,{"$f":"IF('A. Breakdown'!I6=\"\",\"\",VLOOKUP('A. Breakdown'!I6,'D. Handelingsperspectief'!D:N,2,FALSE))","v":""}]
[null,null,null,null,{"$f":"IF(D11=\"\",\"\",VLOOKUP(D11,'A. Breakdown'!E:G,3,FALSE))","v":""}]
[null,5,null,{"$f":"'A. Breakdown'!I7","v":""},{"$f":"(IF(D13=\"\",\"\",VLOOKUP(D13,'A. Breakdown'!E:G,2,FALSE)))","v":""},null,{"$f":"'A. Breakdown'!H7","v":""},null,{"$f":"IF('A. Breakdown'!I7=\"\",\"\",VLOOKUP('A. Breakdown'!I7,'D. Handelingsperspectief'!D:N,2,FALSE))","v":""}]
[null,null,null,null,{"$f":"IF(D13=\"\",\"\",VLOOKUP(D13,'A. Breakdown'!E:G,3,FALSE))","v":""}]
[null,6,null,{"$f":"'A. Breakdown'!I8","v":""},{"$f":"(IF(D15=\"\",\"\",VLOOKUP(D15,'A. Breakdown'!E:G,2,FALSE)))","v":""},null,{"$f":"'A. Breakdown'!H8","v":""},null,{"$f":"IF('A. Breakdown'!I8=\"\",\"\",VLOOKUP('A. Breakdown'!I8,'D. Handelingsperspectief'!D:N,2,FALSE))","v":""}]
[null,null,null,null,{"$f":"IF(D15=\"\",\"\",VLOOKUP(D15,'A. Breakdown'!E:G,3,FALSE))","v":""}]
[null,7,null,{"$f":"'A. Breakdown'!I9","v":""},{"$f":"(IF(D17=\"\",\"\",VLOOKUP(D17,'A. Breakdown'!E:G,2,FALSE)))","v":""},null,{"$f":"'A. Breakdown'!H9","v":""},null,{"$f":"IF('A. Breakdown'!I9=\"\",\"\",VLOOKUP('A. Breakdown'!I9,'D. Handelingsperspectief'!D:N,2,FALSE))","v":""}]
[null,null,null,null,{"$f":"IF(D17=\"\",\"\",VLOOKUP(D17,'A. Breakdown'!E:G,3,FALSE))","v":""}]
[null,8,null,{"$f":"'A. Breakdown'!I10","v":""},{"$f":"(IF(D19=\"\",\"\",VLOOKUP(D19,'A. Breakdown'!E:G,2,FALSE)))","v":""},null,{"$f":"'A. Breakdown'!H10","v":""},null,{"$f":"IF('A. Breakdown'!I10=\"\",\"\",VLOOKUP('A. Breakdown'!I10,'D. Handelingsperspectief'!D:N,2,FALSE))","v":""}]
[null,null,null,null,{"$f":"IF(D19=\"\",\"\",VLOOKUP(D19,'A. Breakdown'!E:G,3,FALSE))","v":""}]
[null,9,null,{"$f":"'A. Breakdown'!I11","v":""},{"$f":"(IF(D21=\"\",\"\",VLOOKUP(D21,'A. Breakdown'!E:G,2,FALSE)))","v":""},null,{"$f":"'A. Breakdown'!H11","v":""},null,{"$f":"IF('A. Breakdown'!I11=\"\",\"\",VLOOKUP('A. Breakdown'!I11,'D. Handelingsperspectief'!D:N,2,FALSE))","v":""}]
[null,null,null,null,{"$f":"IF(D21=\"\",\"\",VLOOKUP(D21,'A. Breakdown'!E:G,3,FALSE))","v":""}]
[null,10,null,{"$f":"'A. Breakdown'!I12","v":""},{"$f":"(IF(D23=\"\",\"\",VLOOKUP(D23,'A. Breakdown'!E:G,2,FALSE)))","v":""},null,{"$f":"'A. Breakdown'!H12","v":""},null,{"$f":"IF('A. Breakdown'!I12=\"\",\"\",VLOOKUP('A. Breakdown'!I12,'D. Handelingsperspectief'!D:N,2,FALSE))","v":""}]
[null,null,null,null,{"$f":"IF(D23=\"\",\"\",VLOOKUP(D23,'A. Breakdown'!E:G,3,FALSE))","v":""}]

{"sheet":"Vergelijken","index":3,"n_rows":16,"n_cols":8,"rows_kept":16,"cut":false,"hidden":false,"merged":[[2,2,2,4],[2,7,4,7],[1,1,2,1],[5,2,5,5]]}
[]
[null,{"$error":"#VALUE!"},"Het Warmtekeuze model",null,null,null,null,{"$error":"#VALUE!"}]
[null,null,"Vergelijken van de resultaten",null,null,null,null,{"$error":"#VALUE!"}]
[]
[null,"Optie A",null,null,"Optie B"]
[null,null,"Met de bovenstaandeopties kunnen de resultaten van het model in meer detail worden vergeleken"]
[null,"Omschrijving",{"$f":"IF(C$5=\"\",\"\",VLOOKUP($C$5,'D. Handelingsperspectief'!$D:$N,2,FALSE))","v":""},null,null,{"$f":"IF(F$5=\"\",\"\",VLOOKUP($F$5,'D. Handelingsperspectief'!$D:$N,2,FALSE))","v":""}]
[null,"Randvoorwaarden",{"$f":"IF(C$5=\"\",\"\",VLOOKUP($C$5,'D. Handelingsperspectief'!$D:$N,3,FALSE))","v":""},null,null,{"$f":"IF(F$5=\"\",\"\",VLOOKUP($F$5,'D. Handelingsperspectief'!$D:$N,3,FALSE))","v":""}]
[null,"Nieuwbouw vs bestaande bouw",{"$f":"IF(C$5=\"\",\"\",VLOOKUP($C$5,'D. Handelingsperspectief'!$D:$N,4,FALSE))","v":""},null,null,{"$f":"IF(F$5=\"\",\"\",VLOOKUP($F$5,'D. Handelingsperspectief'!$D:$N,4,FALSE))","v":""}]
[null,"Kansen",{"$f":"IF(C$5=\"\",\"\",VLOOKUP($C$5,'D. Handelingsperspectief'!$D:$N,5,FALSE))","v":""},null,null,{"$f":"IF(F$5=\"\",\"\",VLOOKUP($F$5,'D. Handelingsperspectief'!$D:$N,5,FALSE))","v":""}]
[null,"Inzet gemeente",{"$f":"IF(C$5=\"\",\"\",VLOOKUP($C$5,'D. Handelingsperspectief'!$D:$N,6,FALSE))","v":""},null,null,{"$f":"IF(F$5=\"\",\"\",VLOOKUP($F$5,'D. Handelingsperspectief'!$D:$N,6,FALSE))","v":""}]
[null,"Kostenverdeling",{"$f":"IF(C$5=\"\",\"\",VLOOKUP($C$5,'D. Handelingsperspectief'!$D:$N,7,FALSE))","v":""},null,null,{"$f":"IF(F$5=\"\",\"\",VLOOKUP($F$5,'D. Handelingsperspectief'!$D:$N,7,FALSE))","v":""}]
[null,"Nader onderzoeken van",{"$f":"IF(C$5=\"\",\"\",VLOOKUP($C$5,'D. Handelingsperspectief'!$D:$N,8,FALSE))","v":""},null,null,{"$f":"IF(F$5=\"\",\"\",VLOOKUP($F$5,'D. Handelingsperspectief'!$D:$N,8,FALSE))","v":""}]
[null,"Samenwerking zoeken met",{"$f":"IF(C$5=\"\",\"\",VLOOKUP($C$5,'D. Handelingsperspectief'!$D:$N,9,FALSE))","v":""},null,null,{"$f":"IF(F$5=\"\",\"\",VLOOKUP($F$5,'D. Handelingsperspectief'!$D:$N,9,FALSE))","v":""}]
[null,"Isolatie stimuleren bij",{"$f":"IF(C$5=\"\",\"\",VLOOKUP($C$5,'D. Handelingsperspectief'!$D:$N,10,FALSE))","v":""},null,null,{"$f":"IF(F$5=\"\",\"\",VLOOKUP($F$5,'D. Handelingsperspectief'!$D:$N,10,FALSE))","v":""}]
[null,"Consequentie keuze",{"$f":"IF(C$5=\"\",\"\",VLOOKUP($C$5,'D. Handelingsperspectief'!$D:$N,11,FALSE))","v":""},null,null,{"$f":"IF(F$5=\"\",\"\",VLOOKUP($F$5,'D. Handelingsperspectief'!$D:$N,11,FALSE))","v":""}]

{"sheet":"Methodiek","index":4,"n_rows":18,"n_cols":2,"rows_kept":18,"cut":false,"hidden":false,"merged":[[0,1,1,2],[0,4,0,8],[1,4,1,6]]}
[null,"Het Warmtekeuze model\nMethodiek"]
[]
[null,"Gemeenten kunnen het WKM invullen met de kenmerken van het te onderzoeken gebied. Dit kan een hele kern zijn, maar ook een deel van een kern of een specifieke woonwijk of specifiek gebied. Het WKM maakt op basis van de ingevulde informatie inzichtelijk welke warmteoplossingen mogelijk kunnen passen. Dit vindt op de volgende methode plaats: "]
[null,"1. Hierbij worden allereerst warmtetechnieken uit een groslijst gefilterd op basis van de invoerparameters die de gebruiker zelf aanlevert. Ter illustratie: technieken op basis van geothermie zijn niet mogelijk zonder een aanwezige potentiële geothermiebron. De gehanteerde limiterende criteria zijn:  "]
[null,"a. Aanwezigheid van warmtebronnen (geothermie, datathermie, restwarmte, thermische energie uit oppervlaktewater, thermische energie uit afvalwater, thermische energie uit drinkwater);  "]
[null,"b. De aanwezigheid van een waterwingebied in combinatie met afhankelijkheid van een WKO en het aantal WEQ.  "]
[null,"Dit resulteert in een overzicht van potentiële warmteoplossingen, maar zegt nog niets over de geschiktheid van deze. "]
[null,"2. Vervolgens zijn kenmerken die de geschiktheid van warmteoplossingen bepalen beoordeeld aan de hand van een 5-punt schaal. Waarbij een score van 5 het meest geschikt is en een score van 1 het minst geschikt. De volgende kenmerken worden beoordeeld (indien van toepassing):  "]
[null,"a. Restwarmte temperatuur, wat invloed heeft op de match tussen aanbod en waarschijnlijke warmtebehoefte. Ook heeft het invloed op de match met het type gebouwen en diens isolatiegraad "]
[null,"b. Netcongestie; Wat invloed heeft op de mogelijkheden voor systemen die een grote energievraag hebben.  "]
[null,"c. Natura2000; "]
[null,"d. Waterwingebied;  "]
[null,"e. Warmtevraagdichtheid;  "]
[null,"f. Energielabel;   "]
[null,"g. Bouwjaar;  "]
[null,"h. Vorm van de kern.  "]
[null,"Over de resulterende waarden wordt een gemiddelde berekend. "]
[null,"3. Tot slot wordt de top 10 samengesteld op basis van een geordende lijst met de hoogst scorende warmteoplossingen. Dit zijn, puur op technisch vlak, de mogelijke warmteoplossingen.  "]

{"sheet":"A. Breakdown","index":5,"n_rows":64,"n_cols":45,"rows_kept":64,"cut":false,"hidden":true,"merged":[[0,7,0,8],[0,9,0,11],[0,23,0,29],[0,43,0,44],[0,30,0,41],[0,13,0,22]]}
[null,null,null,null,null,null,null,"Top 10 Ranking",null,"Weging score",null,null,null,"Warmtebron Filters",null,null,null,null,null,null,null,null,null,"WEQ / Kernen filter",null,null,null,null,null,null,"Scoring",null,null,null,null,null,null,null,null,null,null,null,null,"Kern vorm filter"]
["#",{"$f":"'C. Warmtetechnieken'!A1","v":"Warmtebron"},"Type net","Warmtebron & type net","Subterm","Hoofdterm","Subterm","Ranking/Output","Warmtebron ranking","Ongewogen score","Correctieve Weging (kansrijkheid)","Gewogen score","Filter Wel (1)/Niet (0)","Warmtebron beschikbaar?","Geothermie?","Datathermie?","Aquathermie?","TEO?","TEA?","TED?","Restwarmte?","Ander type warmteoplossing?","Waterwingebied","Andere kernen","Minimum WEG","Warmtebron WEQ Code","Antwoord WEQ code","Andere kernen ?","Totaal WEQ Met andere kernen","Maximaal WEQ (met of zonder andere kernen)","Restwarmte Temp","Restwarmtes temp score","Netcongestie score","Natura 2000 Belemmering","Natura 2000 score","Waterwinning WWG Belemmering","Waterwinning WWG Score","Filter WWG - WKO","Warmtevraagdichtheid","Aflevertemperatuur","Energielabel score","Bouwjaar score",null,"Warmtebron voorkeur kernvorm","Kern type score"]
[1,{"$f":"'C. Warmtetechnieken'!A2","v":"Datathermie"},{"$f":"'C. Warmtetechnieken'!B2","v":"Bronnet"},{"$f":"C3&\" - \"&B3","v":"Bronnet - Datathermie"},"Een bronnet op basis van datathermie","Datathermie","Een bronnet op basis van datathermie",{"$f":"IF(LARGE($L$3:$L$64,1)=0,\"\",LARGE($L$3:$L$64,1))","v":""},{"$f":"IF(H3=\"\",\"\",IFERROR(INDEX($G$3:$G$64, SMALL(IF($L$3:$L$64=H3, ROW($L$3:$L$64)-ROW($L$3)+1), COUNTIF($H$3:H3, H3))),\"\"))","v":""},{"$f":"AVERAGE(\nIF(ISNUMBER(AG3) * (AG3<>0), AG3*'B. Lijsten'!$L$9),\nIF(ISNUMBER(AI3) * (AI3<>0), AI3*'B. Lijsten'!$L$11),\nIF(ISNUMBER(AK3) * (AK3<>0), AK3*'B. Lijsten'!$L$10),\nIF(ISNUMBER(AM3) * (AM3<>0), AM3*'B. Lijsten'!$L$5),\nIF(ISNUMBER(AO3) * (AO3<>0), AO3*'B. Lijsten'!$L$3),\nIF(ISNUMBER(AP3) * (AP3<>0), AP3*'B. Lijsten'!$L$4),\nIF(ISNUMBER(AS3) * (AS3<>0), AS3)\n)","v":0},1,{"$f":"IF(AND(ISNUMBER(J3),ISNUMBER(K3),M3=1,X3=1), J3*K3, 0)","v":0},{"$f":"IF(AND(OR(SUM(O3:P3)>0,SUM(R3:T3)>0,U3>0,V3>0),W3>0,X3=1), 1, 0)","v":0},{"$f":"IF(Invoeren!$G$15=\"Ja\",1,0)","v":0},null,{"$f":"IF(Invoeren!$G$17=\"Ja\",1,0)","v":0},null,null,null,null,null,null,{"$f":"IF(AND(AL3=0,Invoeren!$G$28=\"Ja\"),0,1)","v":1},{"$f":"IF(AD3>=Z3,1,\"\")","v":""},{"$f":"IF('C. Warmtetechnieken'!L2=\"Individueel\",1,\nIF('C. Warmtetechnieken'!L2=\"Klein\",\"2 tot 200\",\nIF('C. Warmtetechnieken'!L2=\"Middel\",\"200 tot 500\",\nIF('C. Warmtetechnieken'!L2=\"Middelgroot\",\"500 tot 1500\",\nIF('C. Warmtetechnieken'!L2=\"Groot\",\"1500 tot 5000\",\nIF('C. Warmtetechnieken'!L2=\"Zeer groot\",\"Meer dan 5000\",\n\"\"))))))","v":"200 tot 500"},{"$f":"IF(Y3=1,1,\nIF(Y3=\"2 tot 200\",2,\nIF(Y3=\"200 tot 500\",3,\nIF(Y3=\"500 tot 1500\",4,\nIF(Y3=\"1500 tot 5000\",5,\nIF(Y3=\"Meer dan 5000\",6,\n\"\"))))))","v":3},{"$f":"IF(Invoeren!$G$32=1,1,\nIF(Invoeren!$G$32=\"2 tot 200\",2,\nIF(Invoeren!$G$32=\"200 tot 500\",3,\nIF(Invoeren!$G$32=\"500 tot 1500\",4,\nIF(Invoeren!$G$32=\"1500 tot 5000\",5,\nIF(Invoeren!$G$32=\"Meer dan 5000\",6,\n\"\"))))))","v":""},{"$f":"IF(Invoeren!$G$34=\"Ja\",1,0)","v":0},{"$f":"IF(Invoeren!$G$35=1,1,\nIF(Invoeren!$G$35=\"2 tot 200\",2,\nIF(Invoeren!$G$35=\"200 tot 500\",3,\nIF(Invoeren!$G$35=\"500 tot 1500\",4,\nIF(Invoeren!$G$35=\"1500 tot 5000\",5,\nIF(Invoeren!$G$35=\"Meer dan 5000\",6,\n\"\"))))))","v":""},{"$f":"MAX(AC3,AA3)","v":0},null,{"$f":"IF(Invoeren!$G$20=\"\",\"\",IF(Invoeren!$G$29=\"\",\"Geen restwarmtebron\",INDEX('B. Lijsten'!$C$44:$G$46, MATCH(Invoeren!$G$20, 'B. Lijsten'!$C$44:$C$46, 0), MATCH($AE3, 'B. Lijsten'!$D$43:$G$43, 0) + 1)))","v":""},{"$f":"IF(Invoeren!$G$27=\"\",\"\",INDEX('B. Lijsten'!$C$17:$F$18, MATCH(Invoeren!$G$27, 'B. Lijsten'!$C$17:$C$18, 0), MATCH('A. Breakdown'!$C3, 'B. Lijsten'!$D$16:$F$16, 0) + 1))","v":""},{"$f":"IF('C. Warmtetechnieken'!O2=\"Nee\",1,0)","v":1},{"$f":"IF(Invoeren!$G$29=\"\",\"\",INDEX('B. Lijsten'!$C$25:$E$26, MATCH(Invoeren!$G$29, 'B. Lijsten'!$C$25:$C$26, 0), MATCH('A. Breakdown'!$AH3, 'B. Lijsten'!$D$24:$E$24, 0) + 1))","v":""},{"$f":"IF('C. Warmtetechnieken'!P2=\"Nee\",1,0)","v":1},{"$f":"IF(W3=0,\"\",IF(Invoeren!$G$28=\"\",\"\",INDEX('B. Lijsten'!$C$21:$E$22,MATCH(Invoeren!$G$28,'B. Lijsten'!$C$21:$C$22,0),MATCH('A. Breakdown'!$AJ3,'B. Lijsten'!$D$20:$E$20,0)+1)))","v":""},{"$f":"AJ3","v":1},{"$f":"IF(Invoeren!$G$12=\"\",\"\",INDEX('B. Lijsten'!$C$38:$F$42, MATCH(Invoeren!$G$12, 'B. Lijsten'!$C$38:$C$42, 0), MATCH('A. Breakdown'!$C3, 'B. Lijsten'!$D$37:$F$37, 0) + 1))","v":""},{"$f":"'C. Warmtetechnieken'!G2","v":"LT"},{"$f":"IF(Invoeren!$G$8=\"\",\"\",INDEX('B. Lijsten'!$C$28:$G$30,MATCH(Invoeren!$G$8,'B. Lijsten'!$C$28:$C$30,0),MATCH($AN3,'B. Lijsten'!$D$27:$G$27,0)+1))","v":""},{"$f":"IF(Invoeren!$G$9=\"\",\"\",INDEX('B. Lijsten'!$C$32:$G$36,MATCH(Invoeren!$G$9,'B. Lijsten'!$C$32:$C$36,0),MATCH($AN3,'B. Lijsten'!$D$31:$G$31,0)+1))","v":""},null,{"$f":"VLOOKUP(D3,Table1[[Warmtebron & type net]:[Energiearmoede verergerd?]],16,FALSE)","v":"Grote dorpen en/of stedelijke kernen"},{"$f":"IF(Invoeren!$G$33=\"\",\"\",INDEX('B. Lijsten'!$C$48:$H$51,MATCH(Invoeren!$G$33,'B. Lijsten'!$C$48:$C$51,0),MATCH($AR3,'B. Lijsten'!$D$47:$H$47,0)+1))","v":""}]
[2,{"$f":"'C. Warmtetechnieken'!A3","v":"Datathermie LT"},{"$f":"'C. Warmtetechnieken'!B3","v":"Warmtenet"},"Warmtenet - Datathermie LT","Een LT-warmtenet op basis van datathermie","Datathermie","Een LT-warmtenet op basis van datathermie",{"$f":"IF(LARGE($L$3:$L$64,2)=0,\"\",LARGE($L$3:$L$64,2))","v":""},{"$f":"IF(H4=\"\",\"\",IFERROR(INDEX($G$3:$G$64, SMALL(IF($L$3:$L$64=H4, ROW($L$3:$L$64)-ROW($L$3)+1), COUNTIF($H$3:H4, H4))),\"\"))","v":""},{"$f":"AVERAGE(\nIF(ISNUMBER(AG4) * (AG4<>0), AG4*'B. Lijsten'!$L$9),\nIF(ISNUMBER(AI4) * (AI4<>0), AI4*'B. Lijsten'!$L$11),\nIF(ISNUMBER(AK4) * (AK4<>0), AK4*'B. Lijsten'!$L$10),\nIF(ISNUMBER(AM4) * (AM4<>0), AM4*'B. Lijsten'!$L$5),\nIF(ISNUMBER(AO4) * (AO4<>0), AO4*'B. Lijsten'!$L$3),\nIF(ISNUMBER(AP4) * (AP4<>0), AP4*'B. Lijsten'!$L$4),\nIF(ISNUMBER(AS4) * (AS4<>0), AS4)\n)","v":0},1,0,0,{"$f":"IF(Invoeren!$G$15=\"Ja\",1,0)","v":0},null,{"$f":"IF(Invoeren!$G$17=\"Ja\",1,0)","v":0},null,null,null,null,null,null,{"$f":"IF(AND(AL4=0,Invoeren!$G$28=\"Ja\"),0,1)","v":1},{"$f":"IF(AD4>=Z4,1,\"\")","v":""},{"$f":"IF('C. Warmtetechnieken'!L3=\"Individueel\",1,\nIF('C. Warmtetechnieken'!L3=\"Klein\",\"2 tot 200\",\nIF('C. Warmtetechnieken'!L3=\"Middel\",\"200 tot 500\",\nIF('C. Warmtetechnieken'!L3=\"Middelgroot\",\"500 tot 1500\",\nIF('C. Warmtetechnieken'!L3=\"Groot\",\"1500 tot 5000\",\nIF('C. Warmtetechnieken'!L3=\"Zeer groot\",\"Meer dan 5000\",\n\"\"))))))","v":"200 tot 500"},3,{"$f":"IF(Invoeren!$G$32=1,1,\nIF(Invoeren!$G$32=\"2 tot 200\",2,\nIF(Invoeren!$G$32=\"200 tot 500\",3,\nIF(Invoeren!$G$32=\"500 tot 1500\",4,\nIF(Invoeren!$G$32=\"1500 tot 5000\",5,\nIF(Invoeren!$G$32=\"Meer dan 5000\",6,\n\"\"))))))","v":""},{"$f":"IF(Invoeren!$G$34=\"Ja\",1,0)","v":0},{"$f":"IF(Invoeren!$G$35=1,1,\nIF(Invoeren!$G$35=\"2 tot 200\",2,\nIF(Invoeren!$G$35=\"200 tot 500\",3,\nIF(Invoeren!$G$35=\"500 tot 1500\",4,\nIF(Invoeren!$G$35=\"1500 tot 5000\",5,\nIF(Invoeren!$G$35=\"Meer dan 5000\",6,\n\"\"))))))","v":""},0,null,{"$f":"IF(Invoeren!$G$20=\"\",\"\",IF(Invoeren!$G$29=\"\",\"Geen restwarmtebron\",INDEX('B. Lijsten'!$C$44:$G$46, MATCH(Invoeren!$G$20, 'B. Lijsten'!$C$44:$C$46, 0), MATCH($AE4, 'B. Lijsten'!$D$43:$G$43, 0) + 1)))","v":""},{"$f":"IF(Invoeren!$G$27=\"\",\"\",INDEX('B. Lijsten'!$C$17:$F$18, MATCH(Invoeren!$G$27, 'B. Lijsten'!$C$17:$C$18, 0), MATCH('A. Breakdown'!$C4, 'B. Lijsten'!$D$16:$F$16, 0) + 1))","v":""},{"$f":"IF('C. Warmtetechnieken'!O3=\"Nee\",1,0)","v":1},{"$f":"IF(Invoeren!$G$29=\"\",\"\",INDEX('B. Lijsten'!$C$25:$E$26, MATCH(Invoeren!$G$29, 'B. Lijsten'!$C$25:$C$26, 0), MATCH('A. Breakdown'!$AH4, 'B. Lijsten'!$D$24:$E$24, 0) + 1))","v":""},{"$f":"IF('C. Warmtetechnieken'!P3=\"Nee\",1,0)","v":1},{"$f":"IF(W4=0,\"\",IF(Invoeren!$G$28=\"\",\"\",INDEX('B. Lijsten'!$C$21:$E$22,MATCH(Invoeren!$G$28,'B. Lijsten'!$C$21:$C$22,0),MATCH('A. Breakdown'!$AJ4,'B. Lijsten'!$D$20:$E$20,0)+1)))","v":""},{"$f":"AJ4","v":1},{"$f":"IF(Invoeren!$G$12=\"\",\"\",INDEX('B. Lijsten'!$C$38:$F$42, MATCH(Invoeren!$G$12, 'B. Lijsten'!$C$38:$C$42, 0), MATCH('A. Breakdown'!$C4, 'B. Lijsten'!$D$37:$F$37, 0) + 1))","v":""},{"$f":"'C. Warmtetechnieken'!G3","v":"LT"},{"$f":"IF(Invoeren!$G$8=\"\",\"\",INDEX('B. Lijsten'!$C$28:$G$30,MATCH(Invoeren!$G$8,'B. Lijsten'!$C$28:$C$30,0),MATCH($AN4,'B. Lijsten'!$D$27:$G$27,0)+1))","v":""},{"$f":"IF(Invoeren!$G$9=\"\",\"\",INDEX('B. Lijsten'!$C$32:$G$36,MATCH(Invoeren!$G$9,'B. Lijsten'!$C$32:$C$36,0),MATCH($AN4,'B. Lijsten'!$D$31:$G$31,0)+1))","v":""},null,{"$f":"VLOOKUP(D4,Table1[[Warmtebron & type net]:[Energiearmoede verergerd?]],16,FALSE)","v":"Grote dorpen en/of stedelijke kernen"},{"$f":"IF(Invoeren!$G$33=\"\",\"\",INDEX('B. Lijsten'!$C$48:$H$51,MATCH(Invoeren!$G$33,'B. Lijsten'!$C$48:$C$51,0),MATCH($AR4,'B. Lijsten'!$D$47:$H$47,0)+1))","v":""}]
[3,{"$f":"'C. Warmtetechnieken'!A4","v":"Diepe geothermie​"},{"$f":"'C. Warmtetechnieken'!B4","v":"Warmtenet"},"Warmtenet - Diepe geothermie​","Een HT-warmtenet op basis van diepe geothermie","Diepe geothermie","Een HT-warmtenet op basis van diepe geothermie",{"$f":"IF(LARGE($L$3:$L$64,3)=0,\"\",LARGE($L$3:$L$64,3))","v":""},{"$f":"IF(H5=\"\",\"\",IFERROR(INDEX($G$3:$G$64, SMALL(IF($L$3:$L$64=H5, ROW($L$3:$L$64)-ROW($L$3)+1), COUNTIF($H$3:H5, H5))),\"\"))","v":""},{"$f":"AVERAGE(\nIF(ISNUMBER(AG5) * (AG5<>0), AG5*'B. Lijsten'!$L$9),\nIF(ISNUMBER(AI5) * (AI5<>0), AI5*'B. Lijsten'!$L$11),\nIF(ISNUMBER(AK5) * (AK5<>0), AK5*'B. Lijsten'!$L$10),\nIF(ISNUMBER(AM5) * (AM5<>0), AM5*'B. Lijsten'!$L$5),\nIF(ISNUMBER(AO5) * (AO5<>0), AO5*'B. Lijsten'!$L$3),\nIF(ISNUMBER(AP5) * (AP5<>0), AP5*'B. Lijsten'!$L$4),\nIF(ISNUMBER(AS5) * (AS5<>0), AS5)\n)","v":0},1.1000000000000001,0,0,{"$f":"IF(Invoeren!$G$15=\"Ja\",1,0)","v":0},{"$f":"IF(Invoeren!$G$16=\"Ja\",1,0)","v":0},null,null,null,null,null,null,null,{"$f":"IF(AND(AL5=0,Invoeren!$G$28=\"Ja\"),0,1)","v":1},"",{"$f":"IF('C. Warmtetechnieken'!L4=\"Individueel\",1,\nIF('C. Warmtetechnieken'!L4=\"Klein\",\"2 tot 200\",\nIF('C. Warmtetechnieken'!L4=\"Middel\",\"200 tot 500\",\nIF('C. Warmtetechnieken'!L4=\"Middelgroot\",\"500 tot 1500\",\nIF('C. Warmtetechnieken'!L4=\"Groot\",\"1500 tot 5000\",\nIF('C. Warmtetechnieken'!L4=\"Zeer groot\",\"Meer dan 5000\",\n\"\"))))))","v":"Meer dan 5000"},6,{"$f":"IF(Invoeren!$G$32=1,1,\nIF(Invoeren!$G$32=\"2 tot 200\",2,\nIF(Invoeren!$G$32=\"200 tot 500\",3,\nIF(Invoeren!$G$32=\"500 tot 1500\",4,\nIF(Invoeren!$G$32=\"1500 tot 5000\",5,\nIF(Invoeren!$G$32=\"Meer dan 5000\",6,\n\"\"))))))","v":""},{"$f":"IF(Invoeren!$G$34=\"Ja\",1,0)","v":0},{"$f":"IF(Invoeren!$G$35=1,1,\nIF(Invoeren!$G$35=\"2 tot 200\",2,\nIF(Invoeren!$G$35=\"200 tot 500\",3,\nIF(Invoeren!$G$35=\"500 tot 1500\",4,\nIF(Invoeren!$G$35=\"1500 tot 5000\",5,\nIF(Invoeren!$G$35=\"Meer dan 5000\",6,\n\"\"))))))","v":""},0,null,{"$f":"IF(Invoeren!$G$20=\"\",\"\",IF(Invoeren!$G$29=\"\",\"Geen restwarmtebron\",INDEX('B. Lijsten'!$C$44:$G$46, MATCH(Invoeren!$G$20, 'B. Lijsten'!$C$44:$C$46, 0), MATCH($AE5, 'B. Lijsten'!$D$43:$G$43, 0) + 1)))","v":""},{"$f":"IF(Invoeren!$G$27=\"\",\"\",INDEX('B. Lijsten'!$C$17:$F$18, MATCH(Invoeren!$G$27, 'B. Lijsten'!$C$17:$C$18, 0), MATCH('A. Breakdown'!$C5, 'B. Lijsten'!$D$16:$F$16, 0) + 1))","v":""},{"$f":"IF('C. Warmtetechnieken'!O4=\"Nee\",1,0)","v":1},{"$f":"IF(Invoeren!$G$29=\"\",\"\",INDEX('B. Lijsten'!$C$25:$E$26, MATCH(Invoeren!$G$29, 'B. Lijsten'!$C$25:$C$26, 0), MATCH('A. Breakdown'!$AH5, 'B. Lijsten'!$D$24:$E$24, 0) + 1))","v":""},{"$f":"IF('C. Warmtetechnieken'!P4=\"Nee\",1,0)","v":0},{"$f":"IF(W5=0,\"\",IF(Invoeren!$G$28=\"\",\"\",INDEX('B. Lijsten'!$C$21:$E$22,MATCH(Invoeren!$G$28,'B. Lijsten'!$C$21:$C$22,0),MATCH('A. Breakdown'!$AJ5,'B. Lijsten'!$D$20:$E$20,0)+1)))","v":""},0,{"$f":"IF(Invoeren!$G$12=\"\",\"\",INDEX('B. Lijsten'!$C$38:$F$42, MATCH(Invoeren!$G$12, 'B. Lijsten'!$C$38:$C$42, 0), MATCH('A. Breakdown'!$C5, 'B. Lijsten'!$D$37:$F$37, 0) + 1))","v":""},{"$f":"'C. Warmtetechnieken'!G4","v":"HT"},{"$f":"IF(Invoeren!$G$8=\"\",\"\",INDEX('B. Lijsten'!$C$28:$G$30,MATCH(Invoeren!$G$8,'B. Lijsten'!$C$28:$C$30,0),MATCH($AN5,'B. Lijsten'!$D$27:$G$27,0)+1))","v":""},{"$f":"IF(Invoeren!$G$9=\"\",\"\",INDEX('B. Lijsten'!$C$32:$G$36,MATCH(Invoeren!$G$9,'B. Lijsten'!$C$32:$C$36,0),MATCH($AN5,'B. Lijsten'!$D$31:$G$31,0)+1))","v":""},null,{"$f":"VLOOKUP(D5,Table1[[Warmtebron & type net]:[Energiearmoede verergerd?]],16,FALSE)","v":"Grote dorpen en/of stedelijke kernen"},{"$f":"IF(Invoeren!$G$33=\"\",\"\",INDEX('B. Lijsten'!$C$48:$H$51,MATCH(Invoeren!$G$33,'B. Lijsten'!$C$48:$C$51,0),MATCH($AR5,'B. Lijsten'!$D$47:$H$47,0)+1))","v":""}]
[4,{"$f":"'C. Warmtetechnieken'!A5","v":"Geothermie + HTO"},{"$f":"'C. Warmtetechnieken'!B5","v":"Warmtenet"},"Warmtenet - Geothermie + HTO","Een HT-warmtenet op basis van geothermie, inclusief HTO (hoge temperatuursopslag)","Geothermie","Een HT-warmtenet op basis van geothermie, inclusief HTO (hoge temperatuursopslag)",{"$f":"IF(LARGE($L$3:$L$64,4)=0,\"\",LARGE($L$3:$L$64,4))","v":""},{"$f":"IF(H6=\"\",\"\",IFERROR(INDEX($G$3:$G$64, SMALL(IF($L$3:$L$64=H6, ROW($L$3:$L$64)-ROW($L$3)+1), COUNTIF($H$3:H6, H6))),\"\"))","v":""},{"$f":"AVERAGE(\nIF(ISNUMBER(AG6) * (AG6<>0), AG6*'B. Lijsten'!$L$9),\nIF(ISNUMBER(AI6) * (AI6<>0), AI6*'B. Lijsten'!$L$11),\nIF(ISNUMBER(AK6) * (AK6<>0), AK6*'B. Lijsten'!$L$10),\nIF(ISNUMBER(AM6) * (AM6<>0), AM6*'B. Lijsten'!$L$5),\nIF(ISNUMBER(AO6) * (AO6<>0), AO6*'B. Lijsten'!$L$3),\nIF(ISNUMBER(AP6) * (AP6<>0), AP6*'B. Lijsten'!$L$4),\nIF(ISNUMBER(AS6) * (AS6<>0), AS6)\n)","v":0},1.1000000000000001,0,0,{"$f":"IF(Invoeren!$G$15=\"Ja\",1,0)","v":0},{"$f":"IF(Invoeren!$G$16=\"Ja\",1,0)","v":0},null,null,null,null,null,null,null,{"$f":"IF(AND(AL6=0,Invoeren!$G$28=\"Ja\"),0,1)","v":1},"",{"$f":"IF('C. Warmtetechnieken'!L5=\"Individueel\",1,\nIF('C. Warmtetechnieken'!L5=\"Klein\",\"2 tot 200\",\nIF('C. Warmtetechnieken'!L5=\"Middel\",\"200 tot 500\",\nIF('C. Warmtetechnieken'!L5=\"Middelgroot\",\"500 tot 1500\",\nIF('C. Warmtetechnieken'!L5=\"Groot\",\"1500 tot 5000\",\nIF('C. Warmtetechnieken'!L5=\"Zeer groot\",\"Meer dan 5000\",\n\"\"))))))","v":"Meer dan 5000"},6,{"$f":"IF(Invoeren!$G$32=1,1,\nIF(Invoeren!$G$32=\"2 tot 200\",2,\nIF(Invoeren!$G$32=\"200 tot 500\",3,\nIF(Invoeren!$G$32=\"500 tot 1500\",4,\nIF(Invoeren!$G$32=\"1500 tot 5000\",5,\nIF(Invoeren!$G$32=\"Meer dan 5000\",6,\n\"\"))))))","v":""},{"$f":"IF(Invoeren!$G$34=\"Ja\",1,0)","v":0},{"$f":"IF(Invoeren!$G$35=1,1,\nIF(Invoeren!$G$35=\"2 tot 200\",2,\nIF(Invoeren!$G$35=\"200 tot 500\",3,\nIF(Invoeren!$G$35=\"500 tot 1500\",4,\nIF(Invoeren!$G$35=\"1500 tot 5000\",5,\nIF(Invoeren!$G$35=\"Meer dan 5000\",6,\n\"\"))))))","v":""},0,null,{"$f":"IF(Invoeren!$G$20=\"\",\"\",IF(Invoeren!$G$29=\"\",\"Geen restwarmtebron\",INDEX('B. Lijsten'!$C$44:$G$46, MATCH(Invoeren!$G$20, 'B. Lijsten'!$C$44:$C$46, 0), MATCH($AE6, 'B. Lijsten'!$D$43:$G$43, 0) + 1)))","v":""},{"$f":"IF(Invoeren!$G$27=\"\",\"\",INDEX('B. Lijsten'!$C$17:$F$18, MATCH(Invoeren!$G$27, 'B. Lijsten'!$C$17:$C$18, 0), MATCH('A. Breakdown'!$C6, 'B. Lijsten'!$D$16:$F$16, 0) + 1))","v":""},{"$f":"IF('C. Warmtetechnieken'!O5=\"Nee\",1,0)","v":1},{"$f":"IF(Invoeren!$G$29=\"\",\"\",INDEX('B. Lijsten'!$C$25:$E$26, MATCH(Invoeren!$G$29, 'B. Lijsten'!$C$25:$C$26, 0), MATCH('A. Breakdown'!$AH6, 'B. Lijsten'!$D$24:$E$24, 0) + 1))","v":""},{"$f":"IF('C. Warmtetechnieken'!P5=\"Nee\",1,0)","v":0},{"$f":"IF(W6=0,\"\",IF(Invoeren!$G$28=\"\",\"\",INDEX('B. Lijsten'!$C$21:$E$22,MATCH(Invoeren!$G$28,'B. Lijsten'!$C$21:$C$22,0),MATCH('A. Breakdown'!$AJ6,'B. Lijsten'!$D$20:$E$20,0)+1)))","v":""},0,{"$f":"IF(Invoeren!$G$12=\"\",\"\",INDEX('B. Lijsten'!$C$38:$F$42, MATCH(Invoeren!$G$12, 'B. Lijsten'!$C$38:$C$42, 0), MATCH('A. Breakdown'!$C6, 'B. Lijsten'!$D$37:$F$37, 0) + 1))","v":""},{"$f":"'C. Warmtetechnieken'!G5","v":"HT"},{"$f":"IF(Invoeren!$G$8=\"\",\"\",INDEX('B. Lijsten'!$C$28:$G$30,MATCH(Invoeren!$G$8,'B. Lijsten'!$C$28:$C$30,0),MATCH($AN6,'B. Lijsten'!$D$27:$G$27,0)+1))","v":""},{"$f":"IF(Invoeren!$G$9=\"\",\"\",INDEX('B. Lijsten'!$C$32:$G$36,MATCH(Invoeren!$G$9,'B. Lijsten'!$C$32:$C$36,0),MATCH($AN6,'B. Lijsten'!$D$31:$G$31,0)+1))","v":""},null,{"$f":"VLOOKUP(D6,Table1[[Warmtebron & type net]:[Energiearmoede verergerd?]],16,FALSE)","v":"Grote dorpen en/of stedelijke kernen"},{"$f":"IF(Invoeren!$G$33=\"\",\"\",INDEX('B. Lijsten'!$C$48:$H$51,MATCH(Invoeren!$G$33,'B. Lijsten'!$C$48:$C$51,0),MATCH($AR6,'B. Lijsten'!$D$47:$H$47,0)+1))","v":""}]
[5,{"$f":"'C. Warmtetechnieken'!A6","v":"Industriele restwarmte"},{"$f":"'C. Warmtetechnieken'!B6","v":"Warmtenet"},"Warmtenet - Industriele restwarmte","Een HT-warmtenet op basis van industriële restwarmte","Industriele restwarmte","Een HT-warmtenet op basis van industriële restwarmte",{"$f":"IF(LARGE($L$3:$L$64,5)=0,\"\",LARGE($L$3:$L$64,5))","v":""},{"$f":"IF(H7=\"\",\"\",IFERROR(INDEX($G$3:$G$64, SMALL(IF($L$3:$L$64=H7, ROW($L$3:$L$64)-ROW($L$3)+1), COUNTIF($H$3:H7, H7))),\"\"))","v":""},{"$f":"AVERAGE(\nIF(ISNUMBER(AG7) * (AG7<>0), AG7*'B. Lijsten'!$L$9),\nIF(ISNUMBER(AI7) * (AI7<>0), AI7*'B. Lijsten'!$L$11),\nIF(ISNUMBER(AK7) * (AK7<>0), AK7*'B. Lijsten'!$L$10),\nIF(ISNUMBER(AM7) * (AM7<>0), AM7*'B. Lijsten'!$L$5),\nIF(ISNUMBER(AO7) * (AO7<>0), AO7*'B. Lijsten'!$L$3),\nIF(ISNUMBER(AP7) * (AP7<>0), AP7*'B. Lijsten'!$L$4),\nIF(ISNUMBER(AS7) * (AS7<>0), AS7)\n)","v":0},1.1000000000000001,0,0,{"$f":"IF(Invoeren!$G$15=\"Ja\",1,0)","v":0},null,null,null,null,null,null,{"$f":"IF(Invoeren!$G$18=\"Ja\",1,0)","v":0},null,{"$f":"IF(AND(AL7=0,Invoeren!$G$28=\"Ja\"),0,1)","v":1},"",{"$f":"IF('C. Warmtetechnieken'!L6=\"Individueel\",1,\nIF('C. Warmtetechnieken'!L6=\"Klein\",\"2 tot 200\",\nIF('C. Warmtetechnieken'!L6=\"Middel\",\"200 tot 500\",\nIF('C. Warmtetechnieken'!L6=\"Middelgroot\",\"500 tot 1500\",\nIF('C. Warmtetechnieken'!L6=\"Groot\",\"1500 tot 5000\",\nIF('C. Warmtetechnieken'!L6=\"Zeer groot\",\"Meer dan 5000\",\n\"\"))))))","v":"1500 tot 5000"},5,{"$f":"IF(Invoeren!$G$32=1,1,\nIF(Invoeren!$G$32=\"2 tot 200\",2,\nIF(Invoeren!$G$32=\"200 tot 500\",3,\nIF(Invoeren!$G$32=\"500 tot 1500\",4,\nIF(Invoeren!$G$32=\"1500 tot 5000\",5,\nIF(Invoeren!$G$32=\"Meer dan 5000\",6,\n\"\"))))))","v":""},{"$f":"IF(Invoeren!$G$34=\"Ja\",1,0)","v":0},{"$f":"IF(Invoeren!$G$35=1,1,\nIF(Invoeren!$G$35=\"2 tot 200\",2,\nIF(Invoeren!$G$35=\"200 tot 500\",3,\nIF(Invoeren!$G$35=\"500 tot 1500\",4,\nIF(Invoeren!$G$35=\"1500 tot 5000\",5,\nIF(Invoeren!$G$35=\"Meer dan 5000\",6,\n\"\"))))))","v":""},0,"HT",{"$f":"IF(Invoeren!$G$20=\"\",\"\",IF(Invoeren!$G$29=\"\",\"Geen restwarmtebron\",INDEX('B. Lijsten'!$C$44:$G$46, MATCH(Invoeren!$G$20, 'B. Lijsten'!$C$44:$C$46, 0), MATCH($AE7, 'B. Lijsten'!$D$43:$G$43, 0) + 1)))","v":""},{"$f":"IF(Invoeren!$G$27=\"\",\"\",INDEX('B. Lijsten'!$C$17:$F$18, MATCH(Invoeren!$G$27, 'B. Lijsten'!$C$17:$C$18, 0), MATCH('A. Breakdown'!$C7, 'B. Lijsten'!$D$16:$F$16, 0) + 1))","v":""},{"$f":"IF('C. Warmtetechnieken'!O6=\"Nee\",1,0)","v":1},{"$f":"IF(Invoeren!$G$29=\"\",\"\",INDEX('B. Lijsten'!$C$25:$E$26, MATCH(Invoeren!$G$29, 'B. Lijsten'!$C$25:$C$26, 0), MATCH('A. Breakdown'!$AH7, 'B. Lijsten'!$D$24:$E$24, 0) + 1))","v":""},{"$f":"IF('C. Warmtetechnieken'!P6=\"Nee\",1,0)","v":1},{"$f":"IF(W7=0,\"\",IF(Invoeren!$G$28=\"\",\"\",INDEX('B. Lijsten'!$C$21:$E$22,MATCH(Invoeren!$G$28,'B. Lijsten'!$C$21:$C$22,0),MATCH('A. Breakdown'!$AJ7,'B. Lijsten'!$D$20:$E$20,0)+1)))","v":""},1,{"$f":"IF(Invoeren!$G$12=\"\",\"\",INDEX('B. Lijsten'!$C$38:$F$42, MATCH(Invoeren!$G$12, 'B. Lijsten'!$C$38:$C$42, 0), MATCH('A. Breakdown'!$C7, 'B. Lijsten'!$D$37:$F$37, 0) + 1))","v":""},{"$f":"'C. Warmtetechnieken'!G6","v":"HT"},{"$f":"IF(Invoeren!$G$8=\"\",\"\",INDEX('B. Lijsten'!$C$28:$G$30,MATCH(Invoeren!$G$8,'B. Lijsten'!$C$28:$C$30,0),MATCH($AN7,'B. Lijsten'!$D$27:$G$27,0)+1))","v":""},{"$f":"IF(Invoeren!$G$9=\"\",\"\",INDEX('B. Lijsten'!$C$32:$G$36,MATCH(Invoeren!$G$9,'B. Lijsten'!$C$32:$C$36,0),MATCH($AN7,'B. Lijsten'!$D$31:$G$31,0)+1))","v":""},null,{"$f":"VLOOKUP(D7,Table1[[Warmtebron & type net]:[Energiearmoede verergerd?]],16,FALSE)","v":"Grote dorpen en/of stedelijke kernen"},{"$f":"IF(Invoeren!$G$33=\"\",\"\",INDEX('B. Lijsten'!$C$48:$H$51,MATCH(Invoeren!$G$33,'B. Lijsten'!$C$48:$C$51,0),MATCH($AR7,'B. Lijsten'!$D$47:$H$47,0)+1))","v":""}]
[6,{"$f":"'C. Warmtetechnieken'!A7","v":"Industriële restwarmte + HTO"},{"$f":"'C. Warmtetechnieken'!B7","v":"Warmtenet"},"Warmtenet - Industriële restwarmte + HTO","Een HT-warmtenet op basis van industriële restwarmte, inclusief HTO (hoge temperatuursopslag)","Industriele restwarmte","Een HT-warmtenet op basis van industriële restwarmte, inclusief HTO (hoge temperatuursopslag)",{"$f":"IF(LARGE($L$3:$L$64,6)=0,\"\",LARGE($L$3:$L$64,6))","v":""},{"$f":"IF(H8=\"\",\"\",IFERROR(INDEX($G$3:$G$64, SMALL(IF($L$3:$L$64=H8, ROW($L$3:$L$64)-ROW($L$3)+1), COUNTIF($H$3:H8, H8))),\"\"))","v":""},{"$f":"AVERAGE(\nIF(ISNUMBER(AG8) * (AG8<>0), AG8*'B. Lijsten'!$L$9),\nIF(ISNUMBER(AI8) * (AI8<>0), AI8*'B. Lijsten'!$L$11),\nIF(ISNUMBER(AK8) * (AK8<>0), AK8*'B. Lijsten'!$L$10),\nIF(ISNUMBER(AM8) * (AM8<>0), AM8*'B. Lijsten'!$L$5),\nIF(ISNUMBER(AO8) * (AO8<>0), AO8*'B. Lijsten'!$L$3),\nIF(ISNUMBER(AP8) * (AP8<>0), AP8*'B. Lijsten'!$L$4),\nIF(ISNUMBER(AS8) * (AS8<>0), AS8)\n)","v":0},1.1000000000000001,0,0,{"$f":"IF(Invoeren!$G$15=\"Ja\",1,0)","v":0},null,null,null,null,null,null,{"$f":"IF(Invoeren!$G$18=\"Ja\",1,0)","v":0},null,{"$f":"IF(AND(AL8=0,Invoeren!$G$28=\"Ja\"),0,1)","v":1},{"$f":"IF(AD8>=Z8,1,\"\")","v":""},{"$f":"IF('C. Warmtetechnieken'!L7=\"Individueel\",1,\nIF('C. Warmtetechnieken'!L7=\"Klein\",\"2 tot 200\",\nIF('C. Warmtetechnieken'!L7=\"Middel\",\"200 tot 500\",\nIF('C. Warmtetechnieken'!L7=\"Middelgroot\",\"500 tot 1500\",\nIF('C. Warmtetechnieken'!L7=\"Groot\",\"1500 tot 5000\",\nIF('C. Warmtetechnieken'!L7=\"Zeer groot\",\"Meer dan 5000\",\n\"\"))))))","v":"Meer dan 5000"},6,{"$f":"IF(Invoeren!$G$32=1,1,\nIF(Invoeren!$G$32=\"2 tot 200\",2,\nIF(Invoeren!$G$32=\"200 tot 500\",3,\nIF(Invoeren!$G$32=\"500 tot 1500\",4,\nIF(Invoeren!$G$32=\"1500 tot 5000\",5,\nIF(Invoeren!$G$32=\"Meer dan 5000\",6,\n\"\"))))))","v":""},{"$f":"IF(Invoeren!$G$34=\"Ja\",1,0)","v":0},{"$f":"IF(Invoeren!$G$35=1,1,\nIF(Invoeren!$G$35=\"2 tot 200\",2,\nIF(Invoeren!$G$35=\"200 tot 500\",3,\nIF(Invoeren!$G$35=\"500 tot 1500\",4,\nIF(Invoeren!$G$35=\"1500 tot 5000\",5,\nIF(Invoeren!$G$35=\"Meer dan 5000\",6,\n\"\"))))))","v":""},0,"HT",{"$f":"IF(Invoeren!$G$20=\"\",\"\",IF(Invoeren!$G$29=\"\",\"Geen restwarmtebron\",INDEX('B. Lijsten'!$C$44:$G$46, MATCH(Invoeren!$G$20, 'B. Lijsten'!$C$44:$C$46, 0), MATCH($AE8, 'B. Lijsten'!$D$43:$G$43, 0) + 1)))","v":""},{"$f":"IF(Invoeren!$G$27=\"\",\"\",INDEX('B. Lijsten'!$C$17:$F$18, MATCH(Invoeren!$G$27, 'B. Lijsten'!$C$17:$C$18, 0), MATCH('A. Breakdown'!$C8, 'B. Lijsten'!$D$16:$F$16, 0) + 1))","v":""},{"$f":"IF('C. Warmtetechnieken'!O7=\"Nee\",1,0)","v":1},{"$f":"IF(Invoeren!$G$29=\"\",\"\",INDEX('B. Lijsten'!$C$25:$E$26, MATCH(Invoeren!$G$29, 'B. Lijsten'!$C$25:$C$26, 0), MATCH('A. Breakdown'!$AH8, 'B. Lijsten'!$D$24:$E$24, 0) + 1))","v":""},{"$f":"IF('C. Warmtetechnieken'!P7=\"Nee\",1,0)","v":0},{"$f":"IF(W8=0,\"\",IF(Invoeren!$G$28=\"\",\"\",INDEX('B. Lijsten'!$C$21:$E$22,MATCH(Invoeren!$G$28,'B. Lijsten'!$C$21:$C$22,0),MATCH('A. Breakdown'!$AJ8,'B. Lijsten'!$D$20:$E$20,0)+1)))","v":""},1,{"$f":"IF(Invoeren!$G$12=\"\",\"\",INDEX('B. Lijsten'!$C$38:$F$42, MATCH(Invoeren!$G$12, 'B. Lijsten'!$C$38:$C$42, 0), MATCH('A. Breakdown'!$C8, 'B. Lijsten'!$D$37:$F$37, 0) + 1))","v":""},{"$f":"'C. Warmtetechnieken'!G7","v":"HT"},{"$f":"IF(Invoeren!$G$8=\"\",\"\",INDEX('B. Lijsten'!$C$28:$G$30,MATCH(Invoeren!$G$8,'B. Lijsten'!$C$28:$C$30,0),MATCH($AN8,'B. Lijsten'!$D$27:$G$27,0)+1))","v":""},{"$f":"IF(Invoeren!$G$9=\"\",\"\",INDEX('B. Lijsten'!$C$32:$G$36,MATCH(Invoeren!$G$9,'B. Lijsten'!$C$32:$C$36,0),MATCH($AN8,'B. Lijsten'!$D$31:$G$31,0)+1))","v":""},null,{"$f":"VLOOKUP(D8,Table1[[Warmtebron & type net]:[Energiearmoede verergerd?]],16,FALSE)","v":"Grote dorpen en/of stedelijke kernen"},{"$f":"IF(Invoeren!$G$33=\"\",\"\",INDEX('B. Lijsten'!$C$48:$H$51,MATCH(Invoeren!$G$33,'B. Lijsten'!$C$48:$C$51,0),MATCH($AR8,'B. Lijsten'!$D$47:$H$47,0)+1))","v":""}]
[7,{"$f":"'C. Warmtetechnieken'!A8","v":"Ondiepe geothermie"},{"$f":"'C. Warmtetechnieken'!B8","v":"Bronnet"},"Bronnet - Ondiepe geothermie","Een bronnet op basis van ondiepe geothermie","Ondiepe geothermie","Een bronnet op basis van ondiepe geothermie",{"$f":"IF(LARGE($L$3:$L$64,7)=0,\"\",LARGE($L$3:$L$64,7))","v":""},{"$f":"IF(H9=\"\",\"\",IFERROR(INDEX($G$3:$G$64, SMALL(IF($L$3:$L$64=H9, ROW($L$3:$L$64)-ROW($L$3)+1), COUNTIF($H$3:H9, H9))),\"\"))","v":""},{"$f":"AVERAGE(\nIF(ISNUMBER(AG9) * (AG9<>0), AG9*'B. Lijsten'!$L$9),\nIF(ISNUMBER(AI9) * (AI9<>0), AI9*'B. Lijsten'!$L$11),\nIF(ISNUMBER(AK9) * (AK9<>0), AK9*'B. Lijsten'!$L$10),\nIF(ISNUMBER(AM9) * (AM9<>0), AM9*'B. Lijsten'!$L$5),\nIF(ISNUMBER(AO9) * (AO9<>0), AO9*'B. Lijsten'!$L$3),\nIF(ISNUMBER(AP9) * (AP9<>0), AP9*'B. Lijsten'!$L$4),\nIF(ISNUMBER(AS9) * (AS9<>0), AS9)\n)","v":0},1.1000000000000001,0,0,{"$f":"IF(Invoeren!$G$15=\"Ja\",1,0)","v":0},{"$f":"IF(Invoeren!$G$16=\"Ja\",1,0)","v":0},null,null,null,null,null,null,null,{"$f":"IF(AND(AL9=0,Invoeren!$G$28=\"Ja\"),0,1)","v":1},"",{"$f":"IF('C. Warmtetechnieken'!L8=\"Individueel\",1,\nIF('C. Warmtetechnieken'!L8=\"Klein\",\"2 tot 200\",\nIF('C. Warmtetechnieken'!L8=\"Middel\",\"200 tot 500\",\nIF('C. Warmtetechnieken'!L8=\"Middelgroot\",\"500 tot 1500\",\nIF('C. Warmtetechnieken'!L8=\"Groot\",\"1500 tot 5000\",\nIF('C. Warmtetechnieken'!L8=\"Zeer groot\",\"Meer dan 5000\",\n\"\"))))))","v":"1500 tot 5000"},5,{"$f":"IF(Invoeren!$G$32=1,1,\nIF(Invoeren!$G$32=\"2 tot 200\",2,\nIF(Invoeren!$G$32=\"200 tot 500\",3,\nIF(Invoeren!$G$32=\"500 tot 1500\",4,\nIF(Invoeren!$G$32=\"1500 tot 5000\",5,\nIF(Invoeren!$G$32=\"Meer dan 5000\",6,\n\"\"))))))","v":""},{"$f":"IF(Invoeren!$G$34=\"Ja\",1,0)","v":0},{"$f":"IF(Invoeren!$G$35=1,1,\nIF(Invoeren!$G$35=\"2 tot 200\",2,\nIF(Invoeren!$G$35=\"200 tot 500\",3,\nIF(Invoeren!$G$35=\"500 tot 1500\",4,\nIF(Invoeren!$G$35=\"1500 tot 5000\",5,\nIF(Invoeren!$G$35=\"Meer dan 5000\",6,\n\"\"))))))","v":""},0,null,{"$f":"IF(Invoeren!$G$20=\"\",\"\",IF(Invoeren!$G$29=\"\",\"Geen restwarmtebron\",INDEX('B. Lijsten'!$C$44:$G$46, MATCH(Invoeren!$G$20, 'B. Lijsten'!$C$44:$C$46, 0), MATCH($AE9, 'B. Lijsten'!$D$43:$G$43, 0) + 1)))","v":""},{"$f":"IF(Invoeren!$G$27=\"\",\"\",INDEX('B. Lijsten'!$C$17:$F$18, MATCH(Invoeren!$G$27, 'B. Lijsten'!$C$17:$C$18, 0), MATCH('A. Breakdown'!$C9, 'B. Lijsten'!$D$16:$F$16, 0) + 1))","v":""},{"$f":"IF('C. Warmtetechnieken'!O8=\"Nee\",1,0)","v":1},{"$f":"IF(Invoeren!$G$29=\"\",\"\",INDEX('B. Lijsten'!$C$25:$E$26, MATCH(Invoeren!$G$29, 'B. Lijsten'!$C$25:$C$26, 0), MATCH('A. Breakdown'!$AH9, 'B. Lijsten'!$D$24:$E$24, 0) + 1))","v":""},{"$f":"IF('C. Warmtetechnieken'!P8=\"Nee\",1,0)","v":0},{"$f":"IF(W9=0,\"\",IF(Invoeren!$G$28=\"\",\"\",INDEX('B. Lijsten'!$C$21:$E$22,MATCH(Invoeren!$G$28,'B. Lijsten'!$C$21:$C$22,0),MATCH('A. Breakdown'!$AJ9,'B. Lijsten'!$D$20:$E$20,0)+1)))","v":""},{"$f":"AJ9","v":0},{"$f":"IF(Invoeren!$G$12=\"\",\"\",INDEX('B. Lijsten'!$C$38:$F$42, MATCH(Invoeren!$G$12, 'B. Lijsten'!$C$38:$C$42, 0), MATCH('A. Breakdown'!$C9, 'B. Lijsten'!$D$37:$F$37, 0) + 1))","v":""},{"$f":"'C. Warmtetechnieken'!G8","v":"LT"},{"$f":"IF(Invoeren!$G$8=\"\",\"\",INDEX('B. Lijsten'!$C$28:$G$30,MATCH(Invoeren!$G$8,'B. Lijsten'!$C$28:$C$30,0),MATCH($AN9,'B. Lijsten'!$D$27:$G$27,0)+1))","v":""},{"$f":"IF(Invoeren!$G$9=\"\",\"\",INDEX('B. Lijsten'!$C$32:$G$36,MATCH(Invoeren!$G$9,'B. Lijsten'!$C$32:$C$36,0),MATCH($AN9,'B. Lijsten'!$D$31:$G$31,0)+1))","v":""},null,{"$f":"VLOOKUP(D9,Table1[[Warmtebron & type net]:[Energiearmoede verergerd?]],16,FALSE)","v":"Grote dorpen en/of stedelijke kernen"},{"$f":"IF(Invoeren!$G$33=\"\",\"\",INDEX('B. Lijsten'!$C$48:$H$51,MATCH(Invoeren!$G$33,'B. Lijsten'!$C$48:$C$51,0),MATCH($AR9,'B. Lijsten'!$D$47:$H$47,0)+1))","v":""}]
[8,{"$f":"'C. Warmtetechnieken'!A9","v":"Ondiepe geothermie​"},{"$f":"'C. Warmtetechnieken'!B9","v":"Warmtenet"},"Warmtenet - Ondiepe geothermie​","Een LT-warmtenet op basis van ondiepe geothermie","Ondiepe geothermie","Een LT-warmtenet op basis van ondiepe geothermie",{"$f":"IF(LARGE($L$3:$L$64,8)=0,\"\",LARGE($L$3:$L$64,8))","v":""},{"$f":"IF(H10=\"\",\"\",IFERROR(INDEX($G$3:$G$64, SMALL(IF($L$3:$L$64=H10, ROW($L$3:$L$64)-ROW($L$3)+1), COUNTIF($H$3:H10, H10))),\"\"))","v":""},{"$f":"AVERAGE(\nIF(ISNUMBER(AG10) * (AG10<>0), AG10*'B. Lijsten'!$L$9),\nIF(ISNUMBER(AI10) * (AI10<>0), AI10*'B. Lijsten'!$L$11),\nIF(ISNUMBER(AK10) * (AK10<>0), AK10*'B. Lijsten'!$L$10),\nIF(ISNUMBER(AM10) * (AM10<>0), AM10*'B. Lijsten'!$L$5),\nIF(ISNUMBER(AO10) * (AO10<>0), AO10*'B. Lijsten'!$L$3),\nIF(ISNUMBER(AP10) * (AP10<>0), AP10*'B. Lijsten'!$L$4),\nIF(ISNUMBER(AS10) * (AS10<>0), AS10)\n)","v":0},1.1000000000000001,0,0,{"$f":"IF(Invoeren!$G$15=\"Ja\",1,0)","v":0},{"$f":"IF(Invoeren!$G$16=\"Ja\",1,0)","v":0},null,null,null,null,null,null,null,{"$f":"IF(AND(AL10=0,Invoeren!$G$28=\"Ja\"),0,1)","v":1},"",{"$f":"IF('C. Warmtetechnieken'!L9=\"Individueel\",1,\nIF('C. Warmtetechnieken'!L9=\"Klein\",\"2 tot 200\",\nIF('C. Warmtetechnieken'!L9=\"Middel\",\"200 tot 500\",\nIF('C. Warmtetechnieken'!L9=\"Middelgroot\",\"500 tot 1500\",\nIF('C. Warmtetechnieken'!L9=\"Groot\",\"1500 tot 5000\",\nIF('C. Warmtetechnieken'!L9=\"Zeer groot\",\"Meer dan 5000\",\n\"\"))))))","v":"1500 tot 5000"},5,{"$f":"IF(Invoeren!$G$32=1,1,\nIF(Invoeren!$G$32=\"2 tot 200\",2,\nIF(Invoeren!$G$32=\"200 tot 500\",3,\nIF(Invoeren!$G$32=\"500 tot 1500\",4,\nIF(Invoeren!$G$32=\"1500 tot 5000\",5,\nIF(Invoeren!$G$32=\"Meer dan 5000\",6,\n\"\"))))))","v":""},{"$f":"IF(Invoeren!$G$34=\"Ja\",1,0)","v":0},{"$f":"IF(Invoeren!$G$35=1,1,\nIF(Invoeren!$G$35=\"2 tot 200\",2,\nIF(Invoeren!$G$35=\"200 tot 500\",3,\nIF(Invoeren!$G$35=\"500 tot 1500\",4,\nIF(Invoeren!$G$35=\"1500 tot 5000\",5,\nIF(Invoeren!$G$35=\"Meer dan 5000\",6,\n\"\"))))))","v":""},0,null,{"$f":"IF(Invoeren!$G$20=\"\",\"\",IF(Invoeren!$G$29=\"\",\"Geen restwarmtebron\",INDEX('B. Lijsten'!$C$44:$G$46, MATCH(Invoeren!$G$20, 'B. Lijsten'!$C$44:$C$46, 0), MATCH($AE10, 'B. Lijsten'!$D$43:$G$43, 0) + 1)))","v":""},{"$f":"IF(Invoeren!$G$27=\"\",\"\",INDEX('B. Lijsten'!$C$17:$F$18, MATCH(Invoeren!$G$27, 'B. Lijsten'!$C$17:$C$18, 0), MATCH('A. Breakdown'!$C10, 'B. Lijsten'!$D$16:$F$16, 0) + 1))","v":""},{"$f":"IF('C. Warmtetechnieken'!O9=\"Nee\",1,0)","v":1},{"$f":"IF(Invoeren!$G$29=\"\",\"\",INDEX('B. Lijsten'!$C$25:$E$26, MATCH(Invoeren!$G$29, 'B. Lijsten'!$C$25:$C$26, 0), MATCH('A. Breakdown'!$AH10, 'B. Lijsten'!$D$24:$E$24, 0) + 1))","v":""},{"$f":"IF('C. Warmtetechnieken'!P9=\"Nee\",1,0)","v":0},{"$f":"IF(W10=0,\"\",IF(Invoeren!$G$28=\"\",\"\",INDEX('B. Lijsten'!$C$21:$E$22,MATCH(Invoeren!$G$28,'B. Lijsten'!$C$21:$C$22,0),MATCH('A. Breakdown'!$AJ10,'B. Lijsten'!$D$20:$E$20,0)+1)))","v":""},{"$f":"AJ10","v":0},{"$f":"IF(Invoeren!$G$12=\"\",\"\",INDEX('B. Lijsten'!$C$38:$F$42, MATCH(Invoeren!$G$12, 'B. Lijsten'!$C$38:$C$42, 0), MATCH('A. Breakdown'!$C10, 'B. Lijsten'!$D$37:$F$37, 0) + 1))","v":""},{"$f":"'C. Warmtetechnieken'!G9","v":"LT"},{"$f":"IF(Invoeren!$G$8=\"\",\"\",INDEX('B. Lijsten'!$C$28:$G$30,MATCH(Invoeren!$G$8,'B. Lijsten'!$C$28:$C$30,0),MATCH($AN10,'B. Lijsten'!$D$27:$G$27,0)+1))","v":""},{"$f":"IF(Invoeren!$G$9=\"\",\"\",INDEX('B. Lijsten'!$C$32:$G$36,MATCH(Invoeren!$G$9,'B. Lijsten'!$C$32:$C$36,0),MATCH($AN10,'B. Lijsten'!$D$31:$G$31,0)+1))","v":""},null,{"$f":"VLOOKUP(D10,Table1[[Warmtebron & type net]:[Energiearmoede verergerd?]],16,FALSE)","v":"Grote dorpen en/of stedelijke kernen"},{"$f":"IF(Invoeren!$G$33=\"\",\"\",INDEX('B. Lijsten'!$C$48:$H$51,MATCH(Invoeren!$G$33,'B. Lijsten'!$C$48:$C$51,0),MATCH($AR10,'B. Lijsten'!$D$47:$H$47,0)+1))","v":""}]
[9,{"$f":"'C. Warmtetechnieken'!A10","v":"Power-to-heat"},{"$f":"'C. Warmtetechnieken'!B10","v":"Warmtenet"},"Warmtenet - Power-to-heat","Een MT-warmtenet op basis van Power-to-Heat, waarbij elektriciteit wordt omgezet in warmte. ","Power-to-Heat","Een MT-warmtenet op basis van Power-to-Heat, waarbij elektriciteit wordt omgezet in warmte. ",{"$f":"IF(LARGE($L$3:$L$64,9)=0,\"\",LARGE($L$3:$L$64,9))","v":""},{"$f":"IF(H11=\"\",\"\",IFERROR(INDEX($G$3:$G$64, SMALL(IF($L$3:$L$64=H11, ROW($L$3:$L$64)-ROW($L$3)+1), COUNTIF($H$3:H11, H11))),\"\"))","v":""},{"$f":"AVERAGE(\nIF(ISNUMBER(AG11) * (AG11<>0), AG11*'B. Lijsten'!$L$9),\nIF(ISNUMBER(AI11) * (AI11<>0), AI11*'B. Lijsten'!$L$11),\nIF(ISNUMBER(AK11) * (AK11<>0), AK11*'B. Lijsten'!$L$10),\nIF(ISNUMBER(AM11) * (AM11<>0), AM11*'B. Lijsten'!$L$5),\nIF(ISNUMBER(AO11) * (AO11<>0), AO11*'B. Lijsten'!$L$3),\nIF(ISNUMBER(AP11) * (AP11<>0), AP11*'B. Lijsten'!$L$4),\nIF(ISNUMBER(AS11) * (AS11<>0), AS11)\n)","v":0},0.8,0,0,null,null,null,null,null,null,null,null,1,{"$f":"IF(AND(AL11=0,Invoeren!$G$28=\"Ja\"),0,1)","v":1},"",{"$f":"IF('C. Warmtetechnieken'!L10=\"Individueel\",1,\nIF('C. Warmtetechnieken'!L10=\"Klein\",\"2 tot 200\",\nIF('C. Warmtetechnieken'!L10=\"Middel\",\"200 tot 500\",\nIF('C. Warmtetechnieken'!L10=\"Middelgroot\",\"500 tot 1500\",\nIF('C. Warmtetechnieken'!L10=\"Groot\",\"1500 tot 5000\",\nIF('C. Warmtetechnieken'!L10=\"Zeer groot\",\"Meer dan 5000\",\n\"\"))))))","v":"Meer dan 5000"},6,{"$f":"IF(Invoeren!$G$32=1,1,\nIF(Invoeren!$G$32=\"2 tot 200\",2,\nIF(Invoeren!$G$32=\"200 tot 500\",3,\nIF(Invoeren!$G$32=\"500 tot 1500\",4,\nIF(Invoeren!$G$32=\"1500 tot 5000\",5,\nIF(Invoeren!$G$32=\"Meer dan 5000\",6,\n\"\"))))))","v":""},{"$f":"IF(Invoeren!$G$34=\"Ja\",1,0)","v":0},{"$f":"IF(Invoeren!$G$35=1,1,\nIF(Invoeren!$G$35=\"2 tot 200\",2,\nIF(Invoeren!$G$35=\"200 tot 500\",3,\nIF(Invoeren!$G$35=\"500 tot 1500\",4,\nIF(Invoeren!$G$35=\"1500 tot 5000\",5,\nIF(Invoeren!$G$35=\"Meer dan 5000\",6,\n\"\"))))))","v":""},0,null,{"$f":"IF(Invoeren!$G$20=\"\",\"\",IF(Invoeren!$G$29=\"\",\"Geen restwarmtebron\",INDEX('B. Lijsten'!$C$44:$G$46, MATCH(Invoeren!$G$20, 'B. Lijsten'!$C$44:$C$46, 0), MATCH($AE11, 'B. Lijsten'!$D$43:$G$43, 0) + 1)))","v":""},{"$f":"IF(Invoeren!$G$27=\"\",\"\",INDEX('B. Lijsten'!$C$17:$F$18, MATCH(Invoeren!$G$27, 'B. Lijsten'!$C$17:$C$18, 0), MATCH('A. Breakdown'!$C11, 'B. Lijsten'!$D$16:$F$16, 0) + 1))","v":""},{"$f":"IF('C. Warmtetechnieken'!O10=\"Nee\",1,0)","v":1},{"$f":"IF(Invoeren!$G$29=\"\",\"\",INDEX('B. Lijsten'!$C$25:$E$26, MATCH(Invoeren!$G$29, 'B. Lijsten'!$C$25:$C$26, 0), MATCH('A. Breakdown'!$AH11, 'B. Lijsten'!$D$24:$E$24, 0) + 1))","v":""},{"$f":"IF('C. Warmtetechnieken'!P10=\"Nee\",1,0)","v":1},{"$f":"IF(W11=0,\"\",IF(Invoeren!$G$28=\"\",\"\",INDEX('B. Lijsten'!$C$21:$E$22,MATCH(Invoeren!$G$28,'B. Lijsten'!$C$21:$C$22,0),MATCH('A. Breakdown'!$AJ11,'B. Lijsten'!$D$20:$E$20,0)+1)))","v":""},1,{"$f":"IF(Invoeren!$G$12=\"\",\"\",INDEX('B. Lijsten'!$C$38:$F$42, MATCH(Invoeren!$G$12, 'B. Lijsten'!$C$38:$C$42, 0), MATCH('A. Breakdown'!$C11, 'B. Lijsten'!$D$37:$F$37, 0) + 1))","v":""},{"$f":"'C. Warmtetechnieken'!G10","v":"MT"},{"$f":"IF(Invoeren!$G$8=\"\",\"\",INDEX('B. Lijsten'!$C$28:$G$30,MATCH(Invoeren!$G$8,'B. Lijsten'!$C$28:$C$30,0),MATCH($AN11,'B. Lijsten'!$D$27:$G$27,0)+1))","v":""},{"$f":"IF(Invoeren!$G$9=\"\",\"\",INDEX('B. Lijsten'!$C$32:$G$36,MATCH(Invoeren!$G$9,'B. Lijsten'!$C$32:$C$36,0),MATCH($AN11,'B. Lijsten'!$D$31:$G$31,0)+1))","v":""},null,{"$f":"VLOOKUP(D11,Table1[[Warmtebron & type net]:[Energiearmoede verergerd?]],16,FALSE)","v":"Grote dorpen en/of stedelijke kernen"},{"$f":"IF(Invoeren!$G$33=\"\",\"\",INDEX('B. Lijsten'!$C$48:$H$51,MATCH(Invoeren!$G$33,'B. Lijsten'!$C$48:$C$51,0),MATCH($AR11,'B. Lijsten'!$D$47:$H$47,0)+1))","v":""}]
[10,{"$f":"'C. Warmtetechnieken'!A11","v":"Datathermie MT"},{"$f":"'C. Warmtetechnieken'!B11","v":"Warmtenet"},"Warmtenet - Datathermie MT","Een MT-warmtenet op basis van datathermie","Datathermie","Een MT-warmtenet op basis van datathermie",{"$f":"IF(LARGE($L$3:$L$64,10)=0,\"\",LARGE($L$3:$L$64,10))","v":""},{"$f":"IF(H12=\"\",\"\",IFERROR(INDEX($G$3:$G$64, SMALL(IF($L$3:$L$64=H12, ROW($L$3:$L$64)-ROW($L$3)+1), COUNTIF($H$3:H12, H12))),\"\"))","v":""},{"$f":"AVERAGE(\nIF(ISNUMBER(AG12) * (AG12<>0), AG12*'B. Lijsten'!$L$9),\nIF(ISNUMBER(AI12) * (AI12<>0), AI12*'B. Lijsten'!$L$11),\nIF(ISNUMBER(AK12) * (AK12<>0), AK12*'B. Lijsten'!$L$10),\nIF(ISNUMBER(AM12) * (AM12<>0), AM12*'B. Lijsten'!$L$5),\nIF(ISNUMBER(AO12) * (AO12<>0), AO12*'B. Lijsten'!$L$3),\nIF(ISNUMBER(AP12) * (AP12<>0), AP12*'B. Lijsten'!$L$4),\nIF(ISNUMBER(AS12) * (AS12<>0), AS12)\n)","v":0},1,0,0,{"$f":"IF(Invoeren!$G$15=\"Ja\",1,0)","v":0},null,{"$f":"IF(Invoeren!$G$17=\"Ja\",1,0)","v":0},null,null,null,null,null,null,{"$f":"IF(AND(AL12=0,Invoeren!$G$28=\"Ja\"),0,1)","v":1},"",{"$f":"IF('C. Warmtetechnieken'!L11=\"Individueel\",1,\nIF('C. Warmtetechnieken'!L11=\"Klein\",\"2 tot 200\",\nIF('C. Warmtetechnieken'!L11=\"Middel\",\"200 tot 500\",\nIF('C. Warmtetechnieken'!L11=\"Middelgroot\",\"500 tot 1500\",\nIF('C. Warmtetechnieken'!L11=\"Groot\",\"1500 tot 5000\",\nIF('C. Warmtetechnieken'!L11=\"Zeer groot\",\"Meer dan 5000\",\n\"\"))))))","v":"200 tot 500"},3,{"$f":"IF(Invoeren!$G$32=1,1,\nIF(Invoeren!$G$32=\"2 tot 200\",2,\nIF(Invoeren!$G$32=\"200 tot 500\",3,\nIF(Invoeren!$G$32=\"500 tot 1500\",4,\nIF(Invoeren!$G$32=\"1500 tot 5000\",5,\nIF(Invoeren!$G$32=\"Meer dan 5000\",6,\n\"\"))))))","v":""},{"$f":"IF(Invoeren!$G$34=\"Ja\",1,0)","v":0},{"$f":"IF(Invoeren!$G$35=1,1,\nIF(Invoeren!$G$35=\"2 tot 200\",2,\nIF(Invoeren!$G$35=\"200 tot 500\",3,\nIF(Invoeren!$G$35=\"500 tot 1500\",4,\nIF(Invoeren!$G$35=\"1500 tot 5000\",5,\nIF(Invoeren!$G$35=\"Meer dan 5000\",6,\n\"\"))))))","v":""},0,null,{"$f":"IF(Invoeren!$G$20=\"\",\"\",IF(Invoeren!$G$29=\"\",\"Geen restwarmtebron\",INDEX('B. Lijsten'!$C$44:$G$46, MATCH(Invoeren!$G$20, 'B. Lijsten'!$C$44:$C$46, 0), MATCH($AE12, 'B. Lijsten'!$D$43:$G$43, 0) + 1)))","v":""},{"$f":"IF(Invoeren!$G$27=\"\",\"\",INDEX('B. Lijsten'!$C$17:$F$18, MATCH(Invoeren!$G$27, 'B. Lijsten'!$C$17:$C$18, 0), MATCH('A. Breakdown'!$C12, 'B. Lijsten'!$D$16:$F$16, 0) + 1))","v":""},{"$f":"IF('C. Warmtetechnieken'!O11=\"Nee\",1,0)","v":1},{"$f":"IF(Invoeren!$G$29=\"\",\"\",INDEX('B. Lijsten'!$C$25:$E$26, MATCH(Invoeren!$G$29, 'B. Lijsten'!$C$25:$C$26, 0), MATCH('A. Breakdown'!$AH12, 'B. Lijsten'!$D$24:$E$24, 0) + 1))","v":""},{"$f":"IF('C. Warmtetechnieken'!P11=\"Nee\",1,0)","v":1},{"$f":"IF(W12=0,\"\",IF(Invoeren!$G$28=\"\",\"\",INDEX('B. Lijsten'!$C$21:$E$22,MATCH(Invoeren!$G$28,'B. Lijsten'!$C$21:$C$22,0),MATCH('A. Breakdown'!$AJ12,'B. Lijsten'!$D$20:$E$20,0)+1)))","v":""},1,{"$f":"IF(Invoeren!$G$12=\"\",\"\",INDEX('B. Lijsten'!$C$38:$F$42, MATCH(Invoeren!$G$12, 'B. Lijsten'!$C$38:$C$42, 0), MATCH('A. Breakdown'!$C12, 'B. Lijsten'!$D$37:$F$37, 0) + 1))","v":""},{"$f":"'C. Warmtetechnieken'!G11","v":"MT"},{"$f":"IF(Invoeren!$G$8=\"\",\"\",INDEX('B. Lijsten'!$C$28:$G$30,MATCH(Invoeren!$G$8,'B. Lijsten'!$C$28:$C$30,0),MATCH($AN12,'B. Lijsten'!$D$27:$G$27,0)+1))","v":""},{"$f":"IF(Invoeren!$G$9=\"\",\"\",INDEX('B. Lijsten'!$C$32:$G$36,MATCH(Invoeren!$G$9,'B. Lijsten'!$C$32:$C$36,0),MATCH($AN12,'B. Lijsten'!$D$31:$G$31,0)+1))","v":""},null,{"$f":"VLOOKUP(D12,Table1[[Warmtebron & type net]:[Energiearmoede verergerd?]],16,FALSE)","v":"Grote dorpen en/of stedelijke kernen"},{"$f":"IF(Invoeren!$G$33=\"\",\"\",INDEX('B. Lijsten'!$C$48:$H$51,MATCH(Invoeren!$G$33,'B. Lijsten'!$C$48:$C$51,0),MATCH($AR12,'B. Lijsten'!$D$47:$H$47,0)+1))","v":""}]
[11,{"$f":"'C. Warmtetechnieken'!A12","v":"Open bodemenergie (WKO)"},{"$f":"'C. Warmtetechnieken'!B12","v":"Bronnet"},"Bronnet - Open bodemenergie (WKO)","Een bronnet op basis van een open bodemenergie systeem (WKO)","Open bodemenergie","Een bronnet op basis van een open bodemenergie systeem (WKO)",null,null,{"$f":"AVERAGE(\nIF(ISNUMBER(AG13) * (AG13<>0), AG13*'B. Lijsten'!$L$9),\nIF(ISNUMBER(AI13) * (AI13<>0), AI13*'B. Lijsten'!$L$11),\nIF(ISNUMBER(AK13) * (AK13<>0), AK13*'B. Lijsten'!$L$10),\nIF(ISNUMBER(AM13) * (AM13<>0), AM13*'B. Lijsten'!$L$5),\nIF(ISNUMBER(AO13) * (AO13<>0), AO13*'B. Lijsten'!$L$3),\nIF(ISNUMBER(AP13) * (AP13<>0), AP13*'B. Lijsten'!$L$4),\nIF(ISNUMBER(AS13) * (AS13<>0), AS13)\n)","v":0},1,0,0,null,null,null,null,null,null,null,null,1,{"$f":"IF(AND(AL13=0,Invoeren!$G$28=\"Ja\"),0,1)","v":1},"",{"$f":"IF('C. Warmtetechnieken'!L12=\"Individueel\",1,\nIF('C. Warmtetechnieken'!L12=\"Klein\",\"2 tot 200\",\nIF('C. Warmtetechnieken'!L12=\"Middel\",\"200 tot 500\",\nIF('C. Warmtetechnieken'!L12=\"Middelgroot\",\"500 tot 1500\",\nIF('C. Warmtetechnieken'!L12=\"Groot\",\"1500 tot 5000\",\nIF('C. Warmtetechnieken'!L12=\"Zeer groot\",\"Meer dan 5000\",\n\"\"))))))","v":"2 tot 200"},2,{"$f":"IF(Invoeren!$G$32=1,1,\nIF(Invoeren!$G$32=\"2 tot 200\",2,\nIF(Invoeren!$G$32=\"200 tot 500\",3,\nIF(Invoeren!$G$32=\"500 tot 1500\",4,\nIF(Invoeren!$G$32=\"1500 tot 5000\",5,\nIF(Invoeren!$G$32=\"Meer dan 5000\",6,\n\"\"))))))","v":""},{"$f":"IF(Invoeren!$G$34=\"Ja\",1,0)","v":0},{"$f":"IF(Invoeren!$G$35=1,1,\nIF(Invoeren!$G$35=\"2 tot 200\",2,\nIF(Invoeren!$G$35=\"200 tot 500\",3,\nIF(Invoeren!$G$35=\"500 tot 1500\",4,\nIF(Invoeren!$G$35=\"1500 tot 5000\",5,\nIF(Invoeren!$G$35=\"Meer dan 5000\",6,\n\"\"))))))","v":""},0,null,{"$f":"IF(Invoeren!$G$20=\"\",\"\",IF(Invoeren!$G$29=\"\",\"Geen restwarmtebron\",INDEX('B. Lijsten'!$C$44:$G$46, MATCH(Invoeren!$G$20, 'B. Lijsten'!$C$44:$C$46, 0), MATCH($AE13, 'B. Lijsten'!$D$43:$G$43, 0) + 1)))","v":""},{"$f":"IF(Invoeren!$G$27=\"\",\"\",INDEX('B. Lijsten'!$C$17:$F$18, MATCH(Invoeren!$G$27, 'B. Lijsten'!$C$17:$C$18, 0), MATCH('A. Breakdown'!$C13, 'B. Lijsten'!$D$16:$F$16, 0) + 1))","v":""},{"$f":"IF('C. Warmtetechnieken'!O12=\"Nee\",1,0)","v":1},{"$f":"IF(Invoeren!$G$29=\"\",\"\",INDEX('B. Lijsten'!$C$25:$E$26, MATCH(Invoeren!$G$29, 'B. Lijsten'!$C$25:$C$26, 0), MATCH('A. Breakdown'!$AH13, 'B. Lijsten'!$D$24:$E$24, 0) + 1))","v":""},{"$f":"IF('C. Warmtetechnieken'!P12=\"Nee\",1,0)","v":0},{"$f":"IF(W13=0,\"\",IF(Invoeren!$G$28=\"\",\"\",INDEX('B. Lijsten'!$C$21:$E$22,MATCH(Invoeren!$G$28,'B. Lijsten'!$C$21:$C$22,0),MATCH('A. Breakdown'!$AJ13,'B. Lijsten'!$D$20:$E$20,0)+1)))","v":""},0,{"$f":"IF(Invoeren!$G$12=\"\",\"\",INDEX('B. Lijsten'!$C$38:$F$42, MATCH(Invoeren!$G$12, 'B. Lijsten'!$C$38:$C$42, 0), MATCH('A. Breakdown'!$C13, 'B. Lijsten'!$D$37:$F$37, 0) + 1))","v":""},{"$f":"'C. Warmtetechnieken'!G12","v":"ZLT"},{"$f":"IF(Invoeren!$G$8=\"\",\"\",INDEX('B. Lijsten'!$C$28:$G$30,MATCH(Invoeren!$G$8,'B. Lijsten'!$C$28:$C$30,0),MATCH($AN13,'B. Lijsten'!$D$27:$G$27,0)+1))","v":""},{"$f":"IF(Invoeren!$G$9=\"\",\"\",INDEX('B. Lijsten'!$C$32:$G$36,MATCH(Invoeren!$G$9,'B. Lijsten'!$C$32:$C$36,0),MATCH($AN13,'B. Lijsten'!$D$31:$G$31,0)+1))","v":""},null,{"$f":"VLOOKUP(D13,Table1[[Warmtebron & type net]:[Energiearmoede verergerd?]],16,FALSE)","v":"Grote dorpen en/of stedelijke kernen"},{"$f":"IF(Invoeren!$G$33=\"\",\"\",INDEX('B. Lijsten'!$C$48:$H$51,MATCH(Invoeren!$G$33,'B. Lijsten'!$C$48:$C$51,0),MATCH($AR13,'B. Lijsten'!$D$47:$H$47,0)+1))","v":""}]
[12,{"$f":"'C. Warmtetechnieken'!A13","v":"Open bodemenergie​ LT (WKO)"},{"$f":"'C. Warmtetechnieken'!B13","v":"Warmtenet"},"Warmtenet - Open bodemenergie​ LT (WKO)","Een LT-warmtenet op basis van een open bodemenergie systeem (WKO)","Open bodemenergie","Een LT-warmtenet op basis van een open bodemenergie systeem (WKO)",null,null,{"$f":"AVERAGE(\nIF(ISNUMBER(AG14) * (AG14<>0), AG14*'B. Lijsten'!$L$9),\nIF(ISNUMBER(AI14) * (AI14<>0), AI14*'B. Lijsten'!$L$11),\nIF(ISNUMBER(AK14) * (AK14<>0), AK14*'B. Lijsten'!$L$10),\nIF(ISNUMBER(AM14) * (AM14<>0), AM14*'B. Lijsten'!$L$5),\nIF(ISNUMBER(AO14) * (AO14<>0), AO14*'B. Lijsten'!$L$3),\nIF(ISNUMBER(AP14) * (AP14<>0), AP14*'B. Lijsten'!$L$4),\nIF(ISNUMBER(AS14) * (AS14<>0), AS14)\n)","v":0},1,0,0,null,null,null,null,null,null,null,null,1,{"$f":"IF(AND(AL14=0,Invoeren!$G$28=\"Ja\"),0,1)","v":1},"",{"$f":"IF('C. Warmtetechnieken'!L13=\"Individueel\",1,\nIF('C. Warmtetechnieken'!L13=\"Klein\",\"2 tot 200\",\nIF('C. Warmtetechnieken'!L13=\"Middel\",\"200 tot 500\",\nIF('C. Warmtetechnieken'!L13=\"Middelgroot\",\"500 tot 1500\",\nIF('C. Warmtetechnieken'!L13=\"Groot\",\"1500 tot 5000\",\nIF('C. Warmtetechnieken'!L13=\"Zeer groot\",\"Meer dan 5000\",\n\"\"))))))","v":"2 tot 200"},2,{"$f":"IF(Invoeren!$G$32=1,1,\nIF(Invoeren!$G$32=\"2 tot 200\",2,\nIF(Invoeren!$G$32=\"200 tot 500\",3,\nIF(Invoeren!$G$32=\"500 tot 1500\",4,\nIF(Invoeren!$G$32=\"1500 tot 5000\",5,\nIF(Invoeren!$G$32=\"Meer dan 5000\",6,\n\"\"))))))","v":""},{"$f":"IF(Invoeren!$G$34=\"Ja\",1,0)","v":0},{"$f":"IF(Invoeren!$G$35=1,1,\nIF(Invoeren!$G$35=\"2 tot 200\",2,\nIF(Invoeren!$G$35=\"200 tot 500\",3,\nIF(Invoeren!$G$35=\"500 tot 1500\",4,\nIF(Invoeren!$G$35=\"1500 tot 5000\",5,\nIF(Invoeren!$G$35=\"Meer dan 5000\",6,\n\"\"))))))","v":""},0,null,{"$f":"IF(Invoeren!$G$20=\"\",\"\",IF(Invoeren!$G$29=\"\",\"Geen restwarmtebron\",INDEX('B. Lijsten'!$C$44:$G$46, MATCH(Invoeren!$G$20, 'B. Lijsten'!$C$44:$C$46, 0), MATCH($AE14, 'B. Lijsten'!$D$43:$G$43, 0) + 1)))","v":""},{"$f":"IF(Invoeren!$G$27=\"\",\"\",INDEX('B. Lijsten'!$C$17:$F$18, MATCH(Invoeren!$G$27, 'B. Lijsten'!$C$17:$C$18, 0), MATCH('A. Breakdown'!$C14, 'B. Lijsten'!$D$16:$F$16, 0) + 1))","v":""},{"$f":"IF('C. Warmtetechnieken'!O13=\"Nee\",1,0)","v":1},{"$f":"IF(Invoeren!$G$29=\"\",\"\",INDEX('B. Lijsten'!$C$25:$E$26, MATCH(Invoeren!$G$29, 'B. Lijsten'!$C$25:$C$26, 0), MATCH('A. Breakdown'!$AH14, 'B. Lijsten'!$D$24:$E$24, 0) + 1))","v":""},{"$f":"IF('C. Warmtetechnieken'!P13=\"Nee\",1,0)","v":0},{"$f":"IF(W14=0,\"\",IF(Invoeren!$G$28=\"\",\"\",INDEX('B. Lijsten'!$C$21:$E$22,MATCH(Invoeren!$G$28,'B. Lijsten'!$C$21:$C$22,0),MATCH('A. Breakdown'!$AJ14,'B. Lijsten'!$D$20:$E$20,0)+1)))","v":""},0,{"$f":"IF(Invoeren!$G$12=\"\",\"\",INDEX('B. Lijsten'!$C$38:$F$42, MATCH(Invoeren!$G$12, 'B. Lijsten'!$C$38:$C$42, 0), MATCH('A. Breakdown'!$C14, 'B. Lijsten'!$D$37:$F$37, 0) + 1))","v":""},{"$f":"'C. Warmtetechnieken'!G13","v":"LT"},{"$f":"IF(Invoeren!$G$8=\"\",\"\",INDEX('B. Lijsten'!$C$28:$G$30,MATCH(Invoeren!$G$8,'B. Lijsten'!$C$28:$C$30,0),MATCH($AN14,'B. Lijsten'!$D$27:$G$27,0)+1))","v":""},{"$f":"IF(Invoeren!$G$9=\"\",\"\",INDEX('B. Lijsten'!$C$32:$G$36,MATCH(Invoeren!$G$9,'B. Lijsten'!$C$32:$C$36,0),MATCH($AN14,'B. Lijsten'!$D$31:$G$31,0)+1))","v":""},null,{"$f":"VLOOKUP(D14,Table1[[Warmtebron & type net]:[Energiearmoede verergerd?]],16,FALSE)","v":"Grote dorpen en/of stedelijke kernen"},{"$f":"IF(Invoeren!$G$33=\"\",\"\",INDEX('B. Lijsten'!$C$48:$H$51,MATCH(Invoeren!$G$33,'B. Lijsten'!$C$48:$C$51,0),MATCH($AR14,'B. Lijsten'!$D$47:$H$47,0)+1))","v":""}]
[13,{"$f":"'C. Warmtetechnieken'!A14","v":"Open bodemenergie​ MT (WKO)"},{"$f":"'C. Warmtetechnieken'!B14","v":"Warmtenet"},"Warmtenet - Open bodemenergie​ MT (WKO)","Een MT-warmtenet op basis van een open bodemenergie systeem (WKO)","Open bodemenergie","Een MT-warmtenet op basis van een open bodemenergie systeem (WKO)",null,null,{"$f":"AVERAGE(\nIF(ISNUMBER(AG15) * (AG15<>0), AG15*'B. Lijsten'!$L$9),\nIF(ISNUMBER(AI15) * (AI15<>0), AI15*'B. Lijsten'!$L$11),\nIF(ISNUMBER(AK15) * (AK15<>0), AK15*'B. Lijsten'!$L$10),\nIF(ISNUMBER(AM15) * (AM15<>0), AM15*'B. Lijsten'!$L$5),\nIF(ISNUMBER(AO15) * (AO15<>0), AO15*'B. Lijsten'!$L$3),\nIF(ISNUMBER(AP15) * (AP15<>0), AP15*'B. Lijsten'!$L$4),\nIF(ISNUMBER(AS15) * (AS15<>0), AS15)\n)","v":0},1,0,0,null,null,null,null,null,null,null,null,1,{"$f":"IF(AND(AL15=0,Invoeren!$G$28=\"Ja\"),0,1)","v":1},"",{"$f":"IF('C. Warmtetechnieken'!L14=\"Individueel\",1,\nIF('C. Warmtetechnieken'!L14=\"Klein\",\"2 tot 200\",\nIF('C. Warmtetechnieken'!L14=\"Middel\",\"200 tot 500\",\nIF('C. Warmtetechnieken'!L14=\"Middelgroot\",\"500 tot 1500\",\nIF('C. Warmtetechnieken'!L14=\"Groot\",\"1500 tot 5000\",\nIF('C. Warmtetechnieken'!L14=\"Zeer groot\",\"Meer dan 5000\",\n\"\"))))))","v":"2 tot 200"},2,{"$f":"IF(Invoeren!$G$32=1,1,\nIF(Invoeren!$G$32=\"2 tot 200\",2,\nIF(Invoeren!$G$32=\"200 tot 500\",3,\nIF(Invoeren!$G$32=\"500 tot 1500\",4,\nIF(Invoeren!$G$32=\"1500 tot 5000\",5,\nIF(Invoeren!$G$32=\"Meer dan 5000\",6,\n\"\"))))))","v":""},{"$f":"IF(Invoeren!$G$34=\"Ja\",1,0)","v":0},{"$f":"IF(Invoeren!$G$35=1,1,\nIF(Invoeren!$G$35=\"2 tot 200\",2,\nIF(Invoeren!$G$35=\"200 tot 500\",3,\nIF(Invoeren!$G$35=\"500 tot 1500\",4,\nIF(Invoeren!$G$35=\"1500 tot 5000\",5,\nIF(Invoeren!$G$35=\"Meer dan 5000\",6,\n\"\"))))))","v":""},0,null,{"$f":"IF(Invoeren!$G$20=\"\",\"\",IF(Invoeren!$G$29=\"\",\"Geen restwarmtebron\",INDEX('B. Lijsten'!$C$44:$G$46, MATCH(Invoeren!$G$20, 'B. Lijsten'!$C$44:$C$46, 0), MATCH($AE15, 'B. Lijsten'!$D$43:$G$43, 0) + 1)))","v":""},{"$f":"IF(Invoeren!$G$27=\"\",\"\",INDEX('B. Lijsten'!$C$17:$F$18, MATCH(Invoeren!$G$27, 'B. Lijsten'!$C$17:$C$18, 0), MATCH('A. Breakdown'!$C15, 'B. Lijsten'!$D$16:$F$16, 0) + 1))","v":""},{"$f":"IF('C. Warmtetechnieken'!O14=\"Nee\",1,0)","v":1},{"$f":"IF(Invoeren!$G$29=\"\",\"\",INDEX('B. Lijsten'!$C$25:$E$26, MATCH(Invoeren!$G$29, 'B. Lijsten'!$C$25:$C$26, 0), MATCH('A. Breakdown'!$AH15, 'B. Lijsten'!$D$24:$E$24, 0) + 1))","v":""},{"$f":"IF('C. Warmtetechnieken'!P14=\"Nee\",1,0)","v":0},{"$f":"IF(W15=0,\"\",IF(Invoeren!$G$28=\"\",\"\",INDEX('B. Lijsten'!$C$21:$E$22,MATCH(Invoeren!$G$28,'B. Lijsten'!$C$21:$C$22,0),MATCH('A. Breakdown'!$AJ15,'B. Lijsten'!$D$20:$E$20,0)+1)))","v":""},0,{"$f":"IF(Invoeren!$G$12=\"\",\"\",INDEX('B. Lijsten'!$C$38:$F$42, MATCH(Invoeren!$G$12, 'B. Lijsten'!$C$38:$C$42, 0), MATCH('A. Breakdown'!$C15, 'B. Lijsten'!$D$37:$F$37, 0) + 1))","v":""},{"$f":"'C. Warmtetechnieken'!G14","v":"MT"},{"$f":"IF(Invoeren!$G$8=\"\",\"\",INDEX('B. Lijsten'!$C$28:$G$30,MATCH(Invoeren!$G$8,'B. Lijsten'!$C$28:$C$30,0),MATCH($AN15,'B. Lijsten'!$D$27:$G$27,0)+1))","v":""},{"$f":"IF(Invoeren!$G$9=\"\",\"\",INDEX('B. Lijsten'!$C$32:$G$36,MATCH(Invoeren!$G$9,'B. Lijsten'!$C$32:$C$36,0),MATCH($AN15,'B. Lijsten'!$D$31:$G$31,0)+1))","v":""},null,{"$f":"VLOOKUP(D15,Table1[[Warmtebron & type net]:[Energiearmoede verergerd?]],16,FALSE)","v":"Grote dorpen en/of stedelijke kernen"},{"$f":"IF(Invoeren!$G$33=\"\",\"\",INDEX('B. Lijsten'!$C$48:$H$51,MATCH(Invoeren!$G$33,'B. Lijsten'!$C$48:$C$51,0),MATCH($AR15,'B. Lijsten'!$D$47:$H$47,0)+1))","v":""}]
[14,{"$f":"'C. Warmtetechnieken'!A15","v":"CV klimaatneutraal gas"},{"$f":"'C. Warmtetechnieken'!B15","v":"Individueel"},"Individueel - CV klimaatneutraal gas","Individuele CV-ketels op basis van klimaatneutraal gas","Klimaatneutraal gas","Individuele CV-ketels op basis van klimaatneutraal gas",null,null,{"$f":"AVERAGE(\nIF(ISNUMBER(AG16) * (AG16<>0), AG16*'B. Lijsten'!$L$9),\nIF(ISNUMBER(AI16) * (AI16<>0), AI16*'B. Lijsten'!$L$11),\nIF(ISNUMBER(AK16) * (AK16<>0), AK16*'B. Lijsten'!$L$10),\nIF(ISNUMBER(AM16) * (AM16<>0), AM16*'B. Lijsten'!$L$5),\nIF(ISNUMBER(AO16) * (AO16<>0), AO16*'B. Lijsten'!$L$3),\nIF(ISNUMBER(AP16) * (AP16<>0), AP16*'B. Lijsten'!$L$4),\nIF(ISNUMBER(AS16) * (AS16<>0), AS16)\n)","v":0},0.5,0,0,null,null,null,null,null,null,null,null,1,{"$f":"IF(AND(AL16=0,Invoeren!$G$28=\"Ja\"),0,1)","v":1},"",{"$f":"IF('C. Warmtetechnieken'!L15=\"Individueel\",1,\nIF('C. Warmtetechnieken'!L15=\"Klein\",\"2 tot 200\",\nIF('C. Warmtetechnieken'!L15=\"Middel\",\"200 tot 500\",\nIF('C. Warmtetechnieken'!L15=\"Middelgroot\",\"500 tot 1500\",\nIF('C. Warmtetechnieken'!L15=\"Groot\",\"1500 tot 5000\",\nIF('C. Warmtetechnieken'!L15=\"Zeer groot\",\"Meer dan 5000\",\n\"\"))))))","v":1},{"$f":"IF(Y16=1,1,\nIF(Y16=\"2 tot 200\",2,\nIF(Y16=\"200 tot 500\",3,\nIF(Y16=\"500 tot 1500\",4,\nIF(Y16=\"1500 tot 5000\",5,\nIF(Y16=\"Meer dan 5000\",6,\n\"\"))))))","v":1},{"$f":"IF(Invoeren!$G$32=1,1,\nIF(Invoeren!$G$32=\"2 tot 200\",2,\nIF(Invoeren!$G$32=\"200 tot 500\",3,\nIF(Invoeren!$G$32=\"500 tot 1500\",4,\nIF(Invoeren!$G$32=\"1500 tot 5000\",5,\nIF(Invoeren!$G$32=\"Meer dan 5000\",6,\n\"\"))))))","v":""},{"$f":"IF(Invoeren!$G$34=\"Ja\",1,0)","v":0},{"$f":"IF(Invoeren!$G$35=1,1,\nIF(Invoeren!$G$35=\"2 tot 200\",2,\nIF(Invoeren!$G$35=\"200 tot 500\",3,\nIF(Invoeren!$G$35=\"500 tot 1500\",4,\nIF(Invoeren!$G$35=\"1500 tot 5000\",5,\nIF(Invoeren!$G$35=\"Meer dan 5000\",6,\n\"\"))))))","v":""},0,null,{"$f":"IF(Invoeren!$G$20=\"\",\"\",IF(Invoeren!$G$29=\"\",\"Geen restwarmtebron\",INDEX('B. Lijsten'!$C$44:$G$46, MATCH(Invoeren!$G$20, 'B. Lijsten'!$C$44:$C$46, 0), MATCH($AE16, 'B. Lijsten'!$D$43:$G$43, 0) + 1)))","v":""},{"$f":"IF(Invoeren!$G$27=\"\",\"\",INDEX('B. Lijsten'!$C$17:$F$18, MATCH(Invoeren!$G$27, 'B. Lijsten'!$C$17:$C$18, 0), MATCH('A. Breakdown'!$C16, 'B. Lijsten'!$D$16:$F$16, 0) + 1))","v":""},{"$f":"IF('C. Warmtetechnieken'!O15=\"Nee\",1,0)","v":1},{"$f":"IF(Invoeren!$G$29=\"\",\"\",INDEX('B. Lijsten'!$C$25:$E$26, MATCH(Invoeren!$G$29, 'B. Lijsten'!$C$25:$C$26, 0), MATCH('A. Breakdown'!$AH16, 'B. Lijsten'!$D$24:$E$24, 0) + 1))","v":""},{"$f":"IF('C. Warmtetechnieken'!P15=\"Nee\",1,0)","v":1},{"$f":"IF(W16=0,\"\",IF(Invoeren!$G$28=\"\",\"\",INDEX('B. Lijsten'!$C$21:$E$22,MATCH(Invoeren!$G$28,'B. Lijsten'!$C$21:$C$22,0),MATCH('A. Breakdown'!$AJ16,'B. Lijsten'!$D$20:$E$20,0)+1)))","v":""},1,{"$f":"IF(Invoeren!$G$12=\"\",\"\",INDEX('B. Lijsten'!$C$38:$F$42, MATCH(Invoeren!$G$12, 'B. Lijsten'!$C$38:$C$42, 0), MATCH('A. Breakdown'!$C16, 'B. Lijsten'!$D$37:$F$37, 0) + 1))","v":""},{"$f":"'C. Warmtetechnieken'!G15","v":"HT"},{"$f":"IF(Invoeren!$G$8=\"\",\"\",INDEX('B. Lijsten'!$C$28:$G$30,MATCH(Invoeren!$G$8,'B. Lijsten'!$C$28:$C$30,0),MATCH($AN16,'B. Lijsten'!$D$27:$G$27,0)+1))","v":""},{"$f":"IF(Invoeren!$G$9=\"\",\"\",INDEX('B. Lijsten'!$C$32:$G$36,MATCH(Invoeren!$G$9,'B. Lijsten'!$C$32:$C$36,0),MATCH($AN16,'B. Lijsten'!$D$31:$G$31,0)+1))","v":""},null,{"$f":"VLOOKUP(D16,Table1[[Warmtebron & type net]:[Energiearmoede verergerd?]],16,FALSE)","v":"Maakt niet uit"},{"$f":"IF(Invoeren!$G$33=\"\",\"\",INDEX('B. Lijsten'!$C$48:$H$51,MATCH(Invoeren!$G$33,'B. Lijsten'!$C$48:$C$51,0),MATCH($AR16,'B. Lijsten'!$D$47:$H$47,0)+1))","v":""}]
[15,{"$f":"'C. Warmtetechnieken'!A16","v":"CV klimaatneutraal gas"},{"$f":"'C. Warmtetechnieken'!B16","v":"Warmtenet"},"Warmtenet - CV klimaatneutraal gas","Een HT-warmtenet op basis van klimaatneutraal gas","Klimaatneutraal gas","Een HT-warmtenet op basis van klimaatneutraal gas",null,null,{"$f":"AVERAGE(\nIF(ISNUMBER(AG17) * (AG17<>0), AG17*'B. Lijsten'!$L$9),\nIF(ISNUMBER(AI17) * (AI17<>0), AI17*'B. Lijsten'!$L$11),\nIF(ISNUMBER(AK17) * (AK17<>0), AK17*'B. Lijsten'!$L$10),\nIF(ISNUMBER(AM17) * (AM17<>0), AM17*'B. Lijsten'!$L$5),\nIF(ISNUMBER(AO17) * (AO17<>0), AO17*'B. Lijsten'!$L$3),\nIF(ISNUMBER(AP17) * (AP17<>0), AP17*'B. Lijsten'!$L$4),\nIF(ISNUMBER(AS17) * (AS17<>0), AS17)\n)","v":0},0.5,0,0,null,null,null,null,null,null,null,null,1,{"$f":"IF(AND(AL17=0,Invoeren!$G$28=\"Ja\"),0,1)","v":1},"",{"$f":"IF('C. Warmtetechnieken'!L16=\"Individueel\",1,\nIF('C. Warmtetechnieken'!L16=\"Klein\",\"2 tot 200\",\nIF('C. Warmtetechnieken'!L16=\"Middel\",\"200 tot 500\",\nIF('C. Warmtetechnieken'!L16=\"Middelgroot\",\"500 tot 1500\",\nIF('C. Warmtetechnieken'!L16=\"Groot\",\"1500 tot 5000\",\nIF('C. Warmtetechnieken'!L16=\"Zeer groot\",\"Meer dan 5000\",\n\"\"))))))","v":"200 tot 500"},3,{"$f":"IF(Invoeren!$G$32=1,1,\nIF(Invoeren!$G$32=\"2 tot 200\",2,\nIF(Invoeren!$G$32=\"200 tot 500\",3,\nIF(Invoeren!$G$32=\"500 tot 1500\",4,\nIF(Invoeren!$G$32=\"1500 tot 5000\",5,\nIF(Invoeren!$G$32=\"Meer dan 5000\",6,\n\"\"))))))","v":""},{"$f":"IF(Invoeren!$G$34=\"Ja\",1,0)","v":0},{"$f":"IF(Invoeren!$G$35=1,1,\nIF(Invoeren!$G$35=\"2 tot 200\",2,\nIF(Invoeren!$G$35=\"200 tot 500\",3,\nIF(Invoeren!$G$35=\"500 tot 1500\",4,\nIF(Invoeren!$G$35=\"1500 tot 5000\",5,\nIF(Invoeren!$G$35=\"Meer dan 5000\",6,\n\"\"))))))","v":""},0,null,{"$f":"IF(Invoeren!$G$20=\"\",\"\",IF(Invoeren!$G$29=\"\",\"Geen restwarmtebron\",INDEX('B. Lijsten'!$C$44:$G$46, MATCH(Invoeren!$G$20, 'B. Lijsten'!$C$44:$C$46, 0), MATCH($AE17, 'B. Lijsten'!$D$43:$G$43, 0) + 1)))","v":""},{"$f":"IF(Invoeren!$G$27=\"\",\"\",INDEX('B. Lijsten'!$C$17:$F$18, MATCH(Invoeren!$G$27, 'B. Lijsten'!$C$17:$C$18, 0), MATCH('A. Breakdown'!$C17, 'B. Lijsten'!$D$16:$F$16, 0) + 1))","v":""},{"$f":"IF('C. Warmtetechnieken'!O16=\"Nee\",1,0)","v":0},{"$f":"IF(Invoeren!$G$29=\"\",\"\",INDEX('B. Lijsten'!$C$25:$E$26, MATCH(Invoeren!$G$29, 'B. Lijsten'!$C$25:$C$26, 0), MATCH('A. Breakdown'!$AH17, 'B. Lijsten'!$D$24:$E$24, 0) + 1))","v":""},{"$f":"IF('C. Warmtetechnieken'!P16=\"Nee\",1,0)","v":1},{"$f":"IF(W17=0,\"\",IF(Invoeren!$G$28=\"\",\"\",INDEX('B. Lijsten'!$C$21:$E$22,MATCH(Invoeren!$G$28,'B. Lijsten'!$C$21:$C$22,0),MATCH('A. Breakdown'!$AJ17,'B. Lijsten'!$D$20:$E$20,0)+1)))","v":""},1,{"$f":"IF(Invoeren!$G$12=\"\",\"\",INDEX('B. Lijsten'!$C$38:$F$42, MATCH(Invoeren!$G$12, 'B. Lijsten'!$C$38:$C$42, 0), MATCH('A. Breakdown'!$C17, 'B. Lijsten'!$D$37:$F$37, 0) + 1))","v":""},{"$f":"'C. Warmtetechnieken'!G16","v":"HT"},{"$f":"IF(Invoeren!$G$8=\"\",\"\",INDEX('B. Lijsten'!$C$28:$G$30,MATCH(Invoeren!$G$8,'B. Lijsten'!$C$28:$C$30,0),MATCH($AN17,'B. Lijsten'!$D$27:$G$27,0)+1))","v":""},{"$f":"IF(Invoeren!$G$9=\"\",\"\",INDEX('B. Lijsten'!$C$32:$G$36,MATCH(Invoeren!$G$9,'B. Lijsten'!$C$32:$C$36,0),MATCH($AN17,'B. Lijsten'!$D$31:$G$31,0)+1))","v":""},null,{"$f":"VLOOKUP(D17,Table1[[Warmtebron & type net]:[Energiearmoede verergerd?]],16,FALSE)","v":"Maakt niet uit"},{"$f":"IF(Invoeren!$G$33=\"\",\"\",INDEX('B. Lijsten'!$C$48:$H$51,MATCH(Invoeren!$G$33,'B. Lijsten'!$C$48:$C$51,0),MATCH($AR17,'B. Lijsten'!$D$47:$H$47,0)+1))","v":""}]
[16,{"$f":"'C. Warmtetechnieken'!A17","v":"Elektrische warmte"},{"$f":"'C. Warmtetechnieken'!B17","v":"Individueel"},"Individueel - Elektrische warmte","Individuele elektrische warmtepompen","Elektrische warmte","Individuele elektrische warmtepompen",null,null,{"$f":"AVERAGE(\nIF(ISNUMBER(AG18) * (AG18<>0), AG18*'B. Lijsten'!$L$9),\nIF(ISNUMBER(AI18) * (AI18<>0), AI18*'B. Lijsten'!$L$11),\nIF(ISNUMBER(AK18) * (AK18<>0), AK18*'B. Lijsten'!$L$10),\nIF(ISNUMBER(AM18) * (AM18<>0), AM18*'B. Lijsten'!$L$5),\nIF(ISNUMBER(AO18) * (AO18<>0), AO18*'B. Lijsten'!$L$3),\nIF(ISNUMBER(AP18) * (AP18<>0), AP18*'B. Lijsten'!$L$4),\nIF(ISNUMBER(AS18) * (AS18<>0), AS18)\n)","v":0},1,0,0,null,null,null,null,null,null,null,null,1,{"$f":"IF(AND(AL18=0,Invoeren!$G$28=\"Ja\"),0,1)","v":1},"",{"$f":"IF('C. Warmtetechnieken'!L17=\"Individueel\",1,\nIF('C. Warmtetechnieken'!L17=\"Klein\",\"2 tot 200\",\nIF('C. Warmtetechnieken'!L17=\"Middel\",\"200 tot 500\",\nIF('C. Warmtetechnieken'!L17=\"Middelgroot\",\"500 tot 1500\",\nIF('C. Warmtetechnieken'!L17=\"Groot\",\"1500 tot 5000\",\nIF('C. Warmtetechnieken'!L17=\"Zeer groot\",\"Meer dan 5000\",\n\"\"))))))","v":1},1,{"$f":"IF(Invoeren!$G$32=1,1,\nIF(Invoeren!$G$32=\"2 tot 200\",2,\nIF(Invoeren!$G$32=\"200 tot 500\",3,\nIF(Invoeren!$G$32=\"500 tot 1500\",4,\nIF(Invoeren!$G$32=\"1500 tot 5000\",5,\nIF(Invoeren!$G$32=\"Meer dan 5000\",6,\n\"\"))))))","v":""},{"$f":"IF(Invoeren!$G$34=\"Ja\",1,0)","v":0},{"$f":"IF(Invoeren!$G$35=1,1,\nIF(Invoeren!$G$35=\"2 tot 200\",2,\nIF(Invoeren!$G$35=\"200 tot 500\",3,\nIF(Invoeren!$G$35=\"500 tot 1500\",4,\nIF(Invoeren!$G$35=\"1500 tot 5000\",5,\nIF(Invoeren!$G$35=\"Meer dan 5000\",6,\n\"\"))))))","v":""},0,null,{"$f":"IF(Invoeren!$G$20=\"\",\"\",IF(Invoeren!$G$29=\"\",\"Geen restwarmtebron\",INDEX('B. Lijsten'!$C$44:$G$46, MATCH(Invoeren!$G$20, 'B. Lijsten'!$C$44:$C$46, 0), MATCH($AE18, 'B. Lijsten'!$D$43:$G$43, 0) + 1)))","v":""},{"$f":"IF(Invoeren!$G$27=\"\",\"\",INDEX('B. Lijsten'!$C$17:$F$18, MATCH(Invoeren!$G$27, 'B. Lijsten'!$C$17:$C$18, 0), MATCH('A. Breakdown'!$C18, 'B. Lijsten'!$D$16:$F$16, 0) + 1))","v":""},{"$f":"IF('C. Warmtetechnieken'!O17=\"Nee\",1,0)","v":1},{"$f":"IF(Invoeren!$G$29=\"\",\"\",INDEX('B. Lijsten'!$C$25:$E$26, MATCH(Invoeren!$G$29, 'B. Lijsten'!$C$25:$C$26, 0), MATCH('A. Breakdown'!$AH18, 'B. Lijsten'!$D$24:$E$24, 0) + 1))","v":""},{"$f":"IF('C. Warmtetechnieken'!P17=\"Nee\",1,0)","v":1},{"$f":"IF(W18=0,\"\",IF(Invoeren!$G$28=\"\",\"\",INDEX('B. Lijsten'!$C$21:$E$22,MATCH(Invoeren!$G$28,'B. Lijsten'!$C$21:$C$22,0),MATCH('A. Breakdown'!$AJ18,'B. Lijsten'!$D$20:$E$20,0)+1)))","v":""},1,{"$f":"IF(Invoeren!$G$12=\"\",\"\",INDEX('B. Lijsten'!$C$38:$F$42, MATCH(Invoeren!$G$12, 'B. Lijsten'!$C$38:$C$42, 0), MATCH('A. Breakdown'!$C18, 'B. Lijsten'!$D$37:$F$37, 0) + 1))","v":""},{"$f":"'C. Warmtetechnieken'!G17","v":"MT"},{"$f":"IF(Invoeren!$G$8=\"\",\"\",INDEX('B. Lijsten'!$C$28:$G$30,MATCH(Invoeren!$G$8,'B. Lijsten'!$C$28:$C$30,0),MATCH($AN18,'B. Lijsten'!$D$27:$G$27,0)+1))","v":""},{"$f":"IF(Invoeren!$G$9=\"\",\"\",INDEX('B. Lijsten'!$C$32:$G$36,MATCH(Invoeren!$G$9,'B. Lijsten'!$C$32:$C$36,0),MATCH($AN18,'B. Lijsten'!$D$31:$G$31,0)+1))","v":""},null,{"$f":"VLOOKUP(D18,Table1[[Warmtebron & type net]:[Energiearmoede verergerd?]],16,FALSE)","v":"Maakt niet uit"},{"$f":"IF(Invoeren!$G$33=\"\",\"\",INDEX('B. Lijsten'!$C$48:$H$51,MATCH(Invoeren!$G$33,'B. Lijsten'!$C$48:$C$51,0),MATCH($AR18,'B. Lijsten'!$D$47:$H$47,0)+1))","v":""}]
[17,{"$f":"'C. Warmtetechnieken'!A18","v":"Hybride warmtepomp"},{"$f":"'C. Warmtetechnieken'!B18","v":"Individueel"},"Individueel - Hybride warmtepomp","Individuele hybride warmtepompen","Hybride warmtepomp","Individuele hybride warmtepompen",null,null,{"$f":"AVERAGE(\nIF(ISNUMBER(AG19) * (AG19<>0), AG19*'B. Lijsten'!$L$9),\nIF(ISNUMBER(AI19) * (AI19<>0), AI19*'B. Lijsten'!$L$11),\nIF(ISNUMBER(AK19) * (AK19<>0), AK19*'B. Lijsten'!$L$10),\nIF(ISNUMBER(AM19) * (AM19<>0), AM19*'B. Lijsten'!$L$5),\nIF(ISNUMBER(AO19) * (AO19<>0), AO19*'B. Lijsten'!$L$3),\nIF(ISNUMBER(AP19) * (AP19<>0), AP19*'B. Lijsten'!$L$4),\nIF(ISNUMBER(AS19) * (AS19<>0), AS19)\n)","v":0},1,0,0,null,null,null,null,null,null,null,null,1,{"$f":"IF(AND(AL19=0,Invoeren!$G$28=\"Ja\"),0,1)","v":1},"",{"$f":"IF('C. Warmtetechnieken'!L18=\"Individueel\",1,\nIF('C. Warmtetechnieken'!L18=\"Klein\",\"2 tot 200\",\nIF('C. Warmtetechnieken'!L18=\"Middel\",\"200 tot 500\",\nIF('C. Warmtetechnieken'!L18=\"Middelgroot\",\"500 tot 1500\",\nIF('C. Warmtetechnieken'!L18=\"Groot\",\"1500 tot 5000\",\nIF('C. Warmtetechnieken'!L18=\"Zeer groot\",\"Meer dan 5000\",\n\"\"))))))","v":1},1,{"$f":"IF(Invoeren!$G$32=1,1,\nIF(Invoeren!$G$32=\"2 tot 200\",2,\nIF(Invoeren!$G$32=\"200 tot 500\",3,\nIF(Invoeren!$G$32=\"500 tot 1500\",4,\nIF(Invoeren!$G$32=\"1500 tot 5000\",5,\nIF(Invoeren!$G$32=\"Meer dan 5000\",6,\n\"\"))))))","v":""},{"$f":"IF(Invoeren!$G$34=\"Ja\",1,0)","v":0},{"$f":"IF(Invoeren!$G$35=1,1,\nIF(Invoeren!$G$35=\"2 tot 200\",2,\nIF(Invoeren!$G$35=\"200 tot 500\",3,\nIF(Invoeren!$G$35=\"500 tot 1500\",4,\nIF(Invoeren!$G$35=\"1500 tot 5000\",5,\nIF(Invoeren!$G$35=\"Meer dan 5000\",6,\n\"\"))))))","v":""},0,null,{"$f":"IF(Invoeren!$G$20=\"\",\"\",IF(Invoeren!$G$29=\"\",\"Geen restwarmtebron\",INDEX('B. Lijsten'!$C$44:$G$46, MATCH(Invoeren!$G$20, 'B. Lijsten'!$C$44:$C$46, 0), MATCH($AE19, 'B. Lijsten'!$D$43:$G$43, 0) + 1)))","v":""},{"$f":"IF(Invoeren!$G$27=\"\",\"\",INDEX('B. Lijsten'!$C$17:$F$18, MATCH(Invoeren!$G$27, 'B. Lijsten'!$C$17:$C$18, 0), MATCH('A. Breakdown'!$C19, 'B. Lijsten'!$D$16:$F$16, 0) + 1))","v":""},{"$f":"IF('C. Warmtetechnieken'!O18=\"Nee\",1,0)","v":1},{"$f":"IF(Invoeren!$G$29=\"\",\"\",INDEX('B. Lijsten'!$C$25:$E$26, MATCH(Invoeren!$G$29, 'B. Lijsten'!$C$25:$C$26, 0), MATCH('A. Breakdown'!$AH19, 'B. Lijsten'!$D$24:$E$24, 0) + 1))","v":""},{"$f":"IF('C. Warmtetechnieken'!P18=\"Nee\",1,0)","v":1},{"$f":"IF(W19=0,\"\",IF(Invoeren!$G$28=\"\",\"\",INDEX('B. Lijsten'!$C$21:$E$22,MATCH(Invoeren!$G$28,'B. Lijsten'!$C$21:$C$22,0),MATCH('A. Breakdown'!$AJ19,'B. Lijsten'!$D$20:$E$20,0)+1)))","v":""},1,{"$f":"IF(Invoeren!$G$12=\"\",\"\",INDEX('B. Lijsten'!$C$38:$F$42, MATCH(Invoeren!$G$12, 'B. Lijsten'!$C$38:$C$42, 0), MATCH('A. Breakdown'!$C19, 'B. Lijsten'!$D$37:$F$37, 0) + 1))","v":""},{"$f":"'C. Warmtetechnieken'!G18","v":"MT"},{"$f":"IF(Invoeren!$G$8=\"\",\"\",INDEX('B. Lijsten'!$C$28:$G$30,MATCH(Invoeren!$G$8,'B. Lijsten'!$C$28:$C$30,0),MATCH($AN19,'B. Lijsten'!$D$27:$G$27,0)+1))","v":""},{"$f":"IF(Invoeren!$G$9=\"\",\"\",INDEX('B. Lijsten'!$C$32:$G$36,MATCH(Invoeren!$G$9,'B. Lijsten'!$C$32:$C$36,0),MATCH($AN19,'B. Lijsten'!$D$31:$G$31,0)+1))","v":""},null,{"$f":"VLOOKUP(D19,Table1[[Warmtebron & type net]:[Energiearmoede verergerd?]],16,FALSE)","v":"Maakt niet uit"},{"$f":"IF(Invoeren!$G$33=\"\",\"\",INDEX('B. Lijsten'!$C$48:$H$51,MATCH(Invoeren!$G$33,'B. Lijsten'!$C$48:$C$51,0),MATCH($AR19,'B. Lijsten'!$D$47:$H$47,0)+1))","v":""}]
[18,{"$f":"'C. Warmtetechnieken'!A19","v":"Lucht/lucht warmtepomp"},{"$f":"'C. Warmtetechnieken'!B19","v":"Individueel"},"Individueel - Lucht/lucht warmtepomp","Individuele lucht-lucht warmtepompen","Buitenlucht","Individuele lucht-lucht warmtepompen",null,null,{"$f":"AVERAGE(\nIF(ISNUMBER(AG20) * (AG20<>0), AG20*'B. Lijsten'!$L$9),\nIF(ISNUMBER(AI20) * (AI20<>0), AI20*'B. Lijsten'!$L$11),\nIF(ISNUMBER(AK20) * (AK20<>0), AK20*'B. Lijsten'!$L$10),\nIF(ISNUMBER(AM20) * (AM20<>0), AM20*'B. Lijsten'!$L$5),\nIF(ISNUMBER(AO20) * (AO20<>0), AO20*'B. Lijsten'!$L$3),\nIF(ISNUMBER(AP20) * (AP20<>0), AP20*'B. Lijsten'!$L$4),\nIF(ISNUMBER(AS20) * (AS20<>0), AS20)\n)","v":0},1,0,0,null,null,null,null,null,null,null,null,1,{"$f":"IF(AND(AL20=0,Invoeren!$G$28=\"Ja\"),0,1)","v":1},"",{"$f":"IF('C. Warmtetechnieken'!L19=\"Individueel\",1,\nIF('C. Warmtetechnieken'!L19=\"Klein\",\"2 tot 200\",\nIF('C. Warmtetechnieken'!L19=\"Middel\",\"200 tot 500\",\nIF('C. Warmtetechnieken'!L19=\"Middelgroot\",\"500 tot 1500\",\nIF('C. Warmtetechnieken'!L19=\"Groot\",\"1500 tot 5000\",\nIF('C. Warmtetechnieken'!L19=\"Zeer groot\",\"Meer dan 5000\",\n\"\"))))))","v":1},1,{"$f":"IF(Invoeren!$G$32=1,1,\nIF(Invoeren!$G$32=\"2 tot 200\",2,\nIF(Invoeren!$G$32=\"200 tot 500\",3,\nIF(Invoeren!$G$32=\"500 tot 1500\",4,\nIF(Invoeren!$G$32=\"1500 tot 5000\",5,\nIF(Invoeren!$G$32=\"Meer dan 5000\",6,\n\"\"))))))","v":""},{"$f":"IF(Invoeren!$G$34=\"Ja\",1,0)","v":0},{"$f":"IF(Invoeren!$G$35=1,1,\nIF(Invoeren!$G$35=\"2 tot 200\",2,\nIF(Invoeren!$G$35=\"200 tot 500\",3,\nIF(Invoeren!$G$35=\"500 tot 1500\",4,\nIF(Invoeren!$G$35=\"1500 tot 5000\",5,\nIF(Invoeren!$G$35=\"Meer dan 5000\",6,\n\"\"))))))","v":""},0,null,{"$f":"IF(Invoeren!$G$20=\"\",\"\",IF(Invoeren!$G$29=\"\",\"Geen restwarmtebron\",INDEX('B. Lijsten'!$C$44:$G$46, MATCH(Invoeren!$G$20, 'B. Lijsten'!$C$44:$C$46, 0), MATCH($AE20, 'B. Lijsten'!$D$43:$G$43, 0) + 1)))","v":""},{"$f":"IF(Invoeren!$G$27=\"\",\"\",INDEX('B. Lijsten'!$C$17:$F$18, MATCH(Invoeren!$G$27, 'B. Lijsten'!$C$17:$C$18, 0), MATCH('A. Breakdown'!$C20, 'B. Lijsten'!$D$16:$F$16, 0) + 1))","v":""},{"$f":"IF('C. Warmtetechnieken'!O19=\"Nee\",1,0)","v":1},{"$f":"IF(Invoeren!$G$29=\"\",\"\",INDEX('B. Lijsten'!$C$25:$E$26, MATCH(Invoeren!$G$29, 'B. Lijsten'!$C$25:$C$26, 0), MATCH('A. Breakdown'!$AH20, 'B. Lijsten'!$D$24:$E$24, 0) + 1))","v":""},{"$f":"IF('C. Warmtetechnieken'!P19=\"Nee\",1,0)","v":1},{"$f":"IF(W20=0,\"\",IF(Invoeren!$G$28=\"\",\"\",INDEX('B. Lijsten'!$C$21:$E$22,MATCH(Invoeren!$G$28,'B. Lijsten'!$C$21:$C$22,0),MATCH('A. Breakdown'!$AJ20,'B. Lijsten'!$D$20:$E$20,0)+1)))","v":""},1,{"$f":"IF(Invoeren!$G$12=\"\",\"\",INDEX('B. Lijsten'!$C$38:$F$42, MATCH(Invoeren!$G$12, 'B. Lijsten'!$C$38:$C$42, 0), MATCH('A. Breakdown'!$C20, 'B. Lijsten'!$D$37:$F$37, 0) + 1))","v":""},{"$f":"'C. Warmtetechnieken'!G19","v":"ZLT"},{"$f":"IF(Invoeren!$G$8=\"\",\"\",INDEX('B. Lijsten'!$C$28:$G$30,MATCH(Invoeren!$G$8,'B. Lijsten'!$C$28:$C$30,0),MATCH($AN20,'B. Lijsten'!$D$27:$G$27,0)+1))","v":""},{"$f":"IF(Invoeren!$G$9=\"\",\"\",INDEX('B. Lijsten'!$C$32:$G$36,MATCH(Invoeren!$G$9,'B. Lijsten'!$C$32:$C$36,0),MATCH($AN20,'B. Lijsten'!$D$31:$G$31,0)+1))","v":""},null,{"$f":"VLOOKUP(D20,Table1[[Warmtebron & type net]:[Energiearmoede verergerd?]],16,FALSE)","v":"Maakt niet uit"},{"$f":"IF(Invoeren!$G$33=\"\",\"\",INDEX('B. Lijsten'!$C$48:$H$51,MATCH(Invoeren!$G$33,'B. Lijsten'!$C$48:$C$51,0),MATCH($AR20,'B. Lijsten'!$D$47:$H$47,0)+1))","v":""}]
[19,{"$f":"'C. Warmtetechnieken'!A20","v":"Lucht/water warmtepomp​"},{"$f":"'C. Warmtetechnieken'!B20","v":"Individueel"},"Individueel - Lucht/water warmtepomp​","Individuele lucht-water warmtepompen","Buitenlucht","Individuele lucht-water warmtepompen",null,null,{"$f":"AVERAGE(\nIF(ISNUMBER(AG21) * (AG21<>0), AG21*'B. Lijsten'!$L$9),\nIF(ISNUMBER(AI21) * (AI21<>0), AI21*'B. Lijsten'!$L$11),\nIF(ISNUMBER(AK21) * (AK21<>0), AK21*'B. Lijsten'!$L$10),\nIF(ISNUMBER(AM21) * (AM21<>0), AM21*'B. Lijsten'!$L$5),\nIF(ISNUMBER(AO21) * (AO21<>0), AO21*'B. Lijsten'!$L$3),\nIF(ISNUMBER(AP21) * (AP21<>0), AP21*'B. Lijsten'!$L$4),\nIF(ISNUMBER(AS21) * (AS21<>0), AS21)\n)","v":0},1,0,0,null,null,null,null,null,null,null,null,1,{"$f":"IF(AND(AL21=0,Invoeren!$G$28=\"Ja\"),0,1)","v":1},"",{"$f":"IF('C. Warmtetechnieken'!L20=\"Individueel\",1,\nIF('C. Warmtetechnieken'!L20=\"Klein\",\"2 tot 200\",\nIF('C. Warmtetechnieken'!L20=\"Middel\",\"200 tot 500\",\nIF('C. Warmtetechnieken'!L20=\"Middelgroot\",\"500 tot 1500\",\nIF('C. Warmtetechnieken'!L20=\"Groot\",\"1500 tot 5000\",\nIF('C. Warmtetechnieken'!L20=\"Zeer groot\",\"Meer dan 5000\",\n\"\"))))))","v":1},1,{"$f":"IF(Invoeren!$G$32=1,1,\nIF(Invoeren!$G$32=\"2 tot 200\",2,\nIF(Invoeren!$G$32=\"200 tot 500\",3,\nIF(Invoeren!$G$32=\"500 tot 1500\",4,\nIF(Invoeren!$G$32=\"1500 tot 5000\",5,\nIF(Invoeren!$G$32=\"Meer dan 5000\",6,\n\"\"))))))","v":""},{"$f":"IF(Invoeren!$G$34=\"Ja\",1,0)","v":0},{"$f":"IF(Invoeren!$G$35=1,1,\nIF(Invoeren!$G$35=\"2 tot 200\",2,\nIF(Invoeren!$G$35=\"200 tot 500\",3,\nIF(Invoeren!$G$35=\"500 tot 1500\",4,\nIF(Invoeren!$G$35=\"1500 tot 5000\",5,\nIF(Invoeren!$G$35=\"Meer dan 5000\",6,\n\"\"))))))","v":""},0,null,{"$f":"IF(Invoeren!$G$20=\"\",\"\",IF(Invoeren!$G$29=\"\",\"Geen restwarmtebron\",INDEX('B. Lijsten'!$C$44:$G$46, MATCH(Invoeren!$G$20, 'B. Lijsten'!$C$44:$C$46, 0), MATCH($AE21, 'B. Lijsten'!$D$43:$G$43, 0) + 1)))","v":""},{"$f":"IF(Invoeren!$G$27=\"\",\"\",INDEX('B. Lijsten'!$C$17:$F$18, MATCH(Invoeren!$G$27, 'B. Lijsten'!$C$17:$C$18, 0), MATCH('A. Breakdown'!$C21, 'B. Lijsten'!$D$16:$F$16, 0) + 1))","v":""},{"$f":"IF('C. Warmtetechnieken'!O20=\"Nee\",1,0)","v":1},{"$f":"IF(Invoeren!$G$29=\"\",\"\",INDEX('B. Lijsten'!$C$25:$E$26, MATCH(Invoeren!$G$29, 'B. Lijsten'!$C$25:$C$26, 0), MATCH('A. Breakdown'!$AH21, 'B. Lijsten'!$D$24:$E$24, 0) + 1))","v":""},{"$f":"IF('C. Warmtetechnieken'!P20=\"Nee\",1,0)","v":1},{"$f":"IF(W21=0,\"\",IF(Invoeren!$G$28=\"\",\"\",INDEX('B. Lijsten'!$C$21:$E$22,MATCH(Invoeren!$G$28,'B. Lijsten'!$C$21:$C$22,0),MATCH('A. Breakdown'!$AJ21,'B. Lijsten'!$D$20:$E$20,0)+1)))","v":""},1,{"$f":"IF(Invoeren!$G$12=\"\",\"\",INDEX('B. Lijsten'!$C$38:$F$42, MATCH(Invoeren!$G$12, 'B. Lijsten'!$C$38:$C$42, 0), MATCH('A. Breakdown'!$C21, 'B. Lijsten'!$D$37:$F$37, 0) + 1))","v":""},{"$f":"'C. Warmtetechnieken'!G20","v":"ZLT"},{"$f":"IF(Invoeren!$G$8=\"\",\"\",INDEX('B. Lijsten'!$C$28:$G$30,MATCH(Invoeren!$G$8,'B. Lijsten'!$C$28:$C$30,0),MATCH($AN21,'B. Lijsten'!$D$27:$G$27,0)+1))","v":""},{"$f":"IF(Invoeren!$G$9=\"\",\"\",INDEX('B. Lijsten'!$C$32:$G$36,MATCH(Invoeren!$G$9,'B. Lijsten'!$C$32:$C$36,0),MATCH($AN21,'B. Lijsten'!$D$31:$G$31,0)+1))","v":""},null,{"$f":"VLOOKUP(D21,Table1[[Warmtebron & type net]:[Energiearmoede verergerd?]],16,FALSE)","v":"Maakt niet uit"},{"$f":"IF(Invoeren!$G$33=\"\",\"\",INDEX('B. Lijsten'!$C$48:$H$51,MATCH(Invoeren!$G$33,'B. Lijsten'!$C$48:$C$51,0),MATCH($AR21,'B. Lijsten'!$D$47:$H$47,0)+1))","v":""}]
[20,{"$f":"'C. Warmtetechnieken'!A21","v":"PVT"},{"$f":"'C. Warmtetechnieken'!B21","v":"Individueel"},"Individueel - PVT","Individuele PVT-panelen","PVT-panelen","Individuele PVT-panelen",null,null,{"$f":"AVERAGE(\nIF(ISNUMBER(AG22) * (AG22<>0), AG22*'B. Lijsten'!$L$9),\nIF(ISNUMBER(AI22) * (AI22<>0), AI22*'B. Lijsten'!$L$11),\nIF(ISNUMBER(AK22) * (AK22<>0), AK22*'B. Lijsten'!$L$10),\nIF(ISNUMBER(AM22) * (AM22<>0), AM22*'B. Lijsten'!$L$5),\nIF(ISNUMBER(AO22) * (AO22<>0), AO22*'B. Lijsten'!$L$3),\nIF(ISNUMBER(AP22) * (AP22<>0), AP22*'B. Lijsten'!$L$4),\nIF(ISNUMBER(AS22) * (AS22<>0), AS22)\n)","v":0},1,0,0,null,null,null,null,null,null,null,null,1,{"$f":"IF(AND(AL22=0,Invoeren!$G$28=\"Ja\"),0,1)","v":1},"",{"$f":"IF('C. Warmtetechnieken'!L21=\"Individueel\",1,\nIF('C. Warmtetechnieken'!L21=\"Klein\",\"2 tot 200\",\nIF('C. Warmtetechnieken'!L21=\"Middel\",\"200 tot 500\",\nIF('C. Warmtetechnieken'!L21=\"Middelgroot\",\"500 tot 1500\",\nIF('C. Warmtetechnieken'!L21=\"Groot\",\"1500 tot 5000\",\nIF('C. Warmtetechnieken'!L21=\"Zeer groot\",\"Meer dan 5000\",\n\"\"))))))","v":1},1,{"$f":"IF(Invoeren!$G$32=1,1,\nIF(Invoeren!$G$32=\"2 tot 200\",2,\nIF(Invoeren!$G$32=\"200 tot 500\",3,\nIF(Invoeren!$G$32=\"500 tot 1500\",4,\nIF(Invoeren!$G$32=\"1500 tot 5000\",5,\nIF(Invoeren!$G$32=\"Meer dan 5000\",6,\n\"\"))))))","v":""},{"$f":"IF(Invoeren!$G$34=\"Ja\",1,0)","v":0},{"$f":"IF(Invoeren!$G$35=1,1,\nIF(Invoeren!$G$35=\"2 tot 200\",2,\nIF(Invoeren!$G$35=\"200 tot 500\",3,\nIF(Invoeren!$G$35=\"500 tot 1500\",4,\nIF(Invoeren!$G$35=\"1500 tot 5000\",5,\nIF(Invoeren!$G$35=\"Meer dan 5000\",6,\n\"\"))))))","v":""},0,null,{"$f":"IF(Invoeren!$G$20=\"\",\"\",IF(Invoeren!$G$29=\"\",\"Geen restwarmtebron\",INDEX('B. Lijsten'!$C$44:$G$46, MATCH(Invoeren!$G$20, 'B. Lijsten'!$C$44:$C$46, 0), MATCH($AE22, 'B. Lijsten'!$D$43:$G$43, 0) + 1)))","v":""},{"$f":"IF(Invoeren!$G$27=\"\",\"\",INDEX('B. Lijsten'!$C$17:$F$18, MATCH(Invoeren!$G$27, 'B. Lijsten'!$C$17:$C$18, 0), MATCH('A. Breakdown'!$C22, 'B. Lijsten'!$D$16:$F$16, 0) + 1))","v":""},{"$f":"IF('C. Warmtetechnieken'!O21=\"Nee\",1,0)","v":1},{"$f":"IF(Invoeren!$G$29=\"\",\"\",INDEX('B. Lijsten'!$C$25:$E$26, MATCH(Invoeren!$G$29, 'B. Lijsten'!$C$25:$C$26, 0), MATCH('A. Breakdown'!$AH22, 'B. Lijsten'!$D$24:$E$24, 0) + 1))","v":""},{"$f":"IF('C. Warmtetechnieken'!P21=\"Nee\",1,0)","v":1},{"$f":"IF(W22=0,\"\",IF(Invoeren!$G$28=\"\",\"\",INDEX('B. Lijsten'!$C$21:$E$22,MATCH(Invoeren!$G$28,'B. Lijsten'!$C$21:$C$22,0),MATCH('A. Breakdown'!$AJ22,'B. Lijsten'!$D$20:$E$20,0)+1)))","v":""},1,{"$f":"IF(Invoeren!$G$12=\"\",\"\",INDEX('B. Lijsten'!$C$38:$F$42, MATCH(Invoeren!$G$12, 'B. Lijsten'!$C$38:$C$42, 0), MATCH('A. Breakdown'!$C22, 'B. Lijsten'!$D$37:$F$37, 0) + 1))","v":""},{"$f":"'C. Warmtetechnieken'!G21","v":"LT"},{"$f":"IF(Invoeren!$G$8=\"\",\"\",INDEX('B. Lijsten'!$C$28:$G$30,MATCH(Invoeren!$G$8,'B. Lijsten'!$C$28:$C$30,0),MATCH($AN22,'B. Lijsten'!$D$27:$G$27,0)+1))","v":""},{"$f":"IF(Invoeren!$G$9=\"\",\"\",INDEX('B. Lijsten'!$C$32:$G$36,MATCH(Invoeren!$G$9,'B. Lijsten'!$C$32:$C$36,0),MATCH($AN22,'B. Lijsten'!$D$31:$G$31,0)+1))","v":""},null,{"$f":"VLOOKUP(D22,Table1[[Warmtebron & type net]:[Energiearmoede verergerd?]],16,FALSE)","v":"Maakt niet uit"},{"$f":"IF(Invoeren!$G$33=\"\",\"\",INDEX('B. Lijsten'!$C$48:$H$51,MATCH(Invoeren!$G$33,'B. Lijsten'!$C$48:$C$51,0),MATCH($AR22,'B. Lijsten'!$D$47:$H$47,0)+1))","v":""}]
[21,{"$f":"'C. Warmtetechnieken'!A22","v":"Zonnecollectoren"},{"$f":"'C. Warmtetechnieken'!B22","v":"Individueel"},"Individueel - Zonnecollectoren","Individuele zonnecollectoren","Zonthermie","Individuele zonnecollectoren",null,null,{"$f":"AVERAGE(\nIF(ISNUMBER(AG23) * (AG23<>0), AG23*'B. Lijsten'!$L$9),\nIF(ISNUMBER(AI23) * (AI23<>0), AI23*'B. Lijsten'!$L$11),\nIF(ISNUMBER(AK23) * (AK23<>0), AK23*'B. Lijsten'!$L$10),\nIF(ISNUMBER(AM23) * (AM23<>0), AM23*'B. Lijsten'!$L$5),\nIF(ISNUMBER(AO23) * (AO23<>0), AO23*'B. Lijsten'!$L$3),\nIF(ISNUMBER(AP23) * (AP23<>0), AP23*'B. Lijsten'!$L$4),\nIF(ISNUMBER(AS23) * (AS23<>0), AS23)\n)","v":0},1,0,0,null,null,null,null,null,null,null,null,1,{"$f":"IF(AND(AL23=0,Invoeren!$G$28=\"Ja\"),0,1)","v":1},"",{"$f":"IF('C. Warmtetechnieken'!L22=\"Individueel\",1,\nIF('C. Warmtetechnieken'!L22=\"Klein\",\"2 tot 200\",\nIF('C. Warmtetechnieken'!L22=\"Middel\",\"200 tot 500\",\nIF('C. Warmtetechnieken'!L22=\"Middelgroot\",\"500 tot 1500\",\nIF('C. Warmtetechnieken'!L22=\"Groot\",\"1500 tot 5000\",\nIF('C. Warmtetechnieken'!L22=\"Zeer groot\",\"Meer dan 5000\",\n\"\"))))))","v":1},1,{"$f":"IF(Invoeren!$G$32=1,1,\nIF(Invoeren!$G$32=\"2 tot 200\",2,\nIF(Invoeren!$G$32=\"200 tot 500\",3,\nIF(Invoeren!$G$32=\"500 tot 1500\",4,\nIF(Invoeren!$G$32=\"1500 tot 5000\",5,\nIF(Invoeren!$G$32=\"Meer dan 5000\",6,\n\"\"))))))","v":""},{"$f":"IF(Invoeren!$G$34=\"Ja\",1,0)","v":0},{"$f":"IF(Invoeren!$G$35=1,1,\nIF(Invoeren!$G$35=\"2 tot 200\",2,\nIF(Invoeren!$G$35=\"200 tot 500\",3,\nIF(Invoeren!$G$35=\"500 tot 1500\",4,\nIF(Invoeren!$G$35=\"1500 tot 5000\",5,\nIF(Invoeren!$G$35=\"Meer dan 5000\",6,\n\"\"))))))","v":""},0,null,{"$f":"IF(Invoeren!$G$20=\"\",\"\",IF(Invoeren!$G$29=\"\",\"Geen restwarmtebron\",INDEX('B. Lijsten'!$C$44:$G$46, MATCH(Invoeren!$G$20, 'B. Lijsten'!$C$44:$C$46, 0), MATCH($AE23, 'B. Lijsten'!$D$43:$G$43, 0) + 1)))","v":""},{"$f":"IF(Invoeren!$G$27=\"\",\"\",INDEX('B. Lijsten'!$C$17:$F$18, MATCH(Invoeren!$G$27, 'B. Lijsten'!$C$17:$C$18, 0), MATCH('A. Breakdown'!$C23, 'B. Lijsten'!$D$16:$F$16, 0) + 1))","v":""},{"$f":"IF('C. Warmtetechnieken'!O22=\"Nee\",1,0)","v":1},{"$f":"IF(Invoeren!$G$29=\"\",\"\",INDEX('B. Lijsten'!$C$25:$E$26, MATCH(Invoeren!$G$29, 'B. Lijsten'!$C$25:$C$26, 0), MATCH('A. Breakdown'!$AH23, 'B. Lijsten'!$D$24:$E$24, 0) + 1))","v":""},{"$f":"IF('C. Warmtetechnieken'!P22=\"Nee\",1,0)","v":1},{"$f":"IF(W23=0,\"\",IF(Invoeren!$G$28=\"\",\"\",INDEX('B. Lijsten'!$C$21:$E$22,MATCH(Invoeren!$G$28,'B. Lijsten'!$C$21:$C$22,0),MATCH('A. Breakdown'!$AJ23,'B. Lijsten'!$D$20:$E$20,0)+1)))","v":""},1,{"$f":"IF(Invoeren!$G$12=\"\",\"\",INDEX('B. Lijsten'!$C$38:$F$42, MATCH(Invoeren!$G$12, 'B. Lijsten'!$C$38:$C$42, 0), MATCH('A. Breakdown'!$C23, 'B. Lijsten'!$D$37:$F$37, 0) + 1))","v":""},{"$f":"'C. Warmtetechnieken'!G22","v":"LT"},{"$f":"IF(Invoeren!$G$8=\"\",\"\",INDEX('B. Lijsten'!$C$28:$G$30,MATCH(Invoeren!$G$8,'B. Lijsten'!$C$28:$C$30,0),MATCH($AN23,'B. Lijsten'!$D$27:$G$27,0)+1))","v":""},{"$f":"IF(Invoeren!$G$9=\"\",\"\",INDEX('B. Lijsten'!$C$32:$G$36,MATCH(Invoeren!$G$9,'B. Lijsten'!$C$32:$C$36,0),MATCH($AN23,'B. Lijsten'!$D$31:$G$31,0)+1))","v":""},null,{"$f":"VLOOKUP(D23,Table1[[Warmtebron & type net]:[Energiearmoede verergerd?]],16,FALSE)","v":"Maakt niet uit"},{"$f":"IF(Invoeren!$G$33=\"\",\"\",INDEX('B. Lijsten'!$C$48:$H$51,MATCH(Invoeren!$G$33,'B. Lijsten'!$C$48:$C$51,0),MATCH($AR23,'B. Lijsten'!$D$47:$H$47,0)+1))","v":""}]
[22,{"$f":"'C. Warmtetechnieken'!A23","v":"Asfaltthermie - Thermische panelen in de weg"},{"$f":"'C. Warmtetechnieken'!B23","v":"Bronnet"},"Bronnet - Asfaltthermie - Thermische panelen in de weg","Een bronnet op basis van asfaltthermie","Asfaltthermie","Een bronnet op basis van asfaltthermie",null,null,{"$f":"AVERAGE(\nIF(ISNUMBER(AG24) * (AG24<>0), AG24*'B. Lijsten'!$L$9),\nIF(ISNUMBER(AI24) * (AI24<>0), AI24*'B. Lijsten'!$L$11),\nIF(ISNUMBER(AK24) * (AK24<>0), AK24*'B. Lijsten'!$L$10),\nIF(ISNUMBER(AM24) * (AM24<>0), AM24*'B. Lijsten'!$L$5),\nIF(ISNUMBER(AO24) * (AO24<>0), AO24*'B. Lijsten'!$L$3),\nIF(ISNUMBER(AP24) * (AP24<>0), AP24*'B. Lijsten'!$L$4),\nIF(ISNUMBER(AS24) * (AS24<>0), AS24)\n)","v":0},0.7,0,0,null,null,null,null,null,null,null,null,1,{"$f":"IF(AND(AL24=0,Invoeren!$G$28=\"Ja\"),0,1)","v":1},"",{"$f":"IF('C. Warmtetechnieken'!L23=\"Individueel\",1,\nIF('C. Warmtetechnieken'!L23=\"Klein\",\"2 tot 200\",\nIF('C. Warmtetechnieken'!L23=\"Middel\",\"200 tot 500\",\nIF('C. Warmtetechnieken'!L23=\"Middelgroot\",\"500 tot 1500\",\nIF('C. Warmtetechnieken'!L23=\"Groot\",\"1500 tot 5000\",\nIF('C. Warmtetechnieken'!L23=\"Zeer groot\",\"Meer dan 5000\",\n\"\"))))))","v":"200 tot 500"},3,{"$f":"IF(Invoeren!$G$32=1,1,\nIF(Invoeren!$G$32=\"2 tot 200\",2,\nIF(Invoeren!$G$32=\"200 tot 500\",3,\nIF(Invoeren!$G$32=\"500 tot 1500\",4,\nIF(Invoeren!$G$32=\"1500 tot 5000\",5,\nIF(Invoeren!$G$32=\"Meer dan 5000\",6,\n\"\"))))))","v":""},{"$f":"IF(Invoeren!$G$34=\"Ja\",1,0)","v":0},{"$f":"IF(Invoeren!$G$35=1,1,\nIF(Invoeren!$G$35=\"2 tot 200\",2,\nIF(Invoeren!$G$35=\"200 tot 500\",3,\nIF(Invoeren!$G$35=\"500 tot 1500\",4,\nIF(Invoeren!$G$35=\"1500 tot 5000\",5,\nIF(Invoeren!$G$35=\"Meer dan 5000\",6,\n\"\"))))))","v":""},0,null,{"$f":"IF(Invoeren!$G$20=\"\",\"\",IF(Invoeren!$G$29=\"\",\"Geen restwarmtebron\",INDEX('B. Lijsten'!$C$44:$G$46, MATCH(Invoeren!$G$20, 'B. Lijsten'!$C$44:$C$46, 0), MATCH($AE24, 'B. Lijsten'!$D$43:$G$43, 0) + 1)))","v":""},{"$f":"IF(Invoeren!$G$27=\"\",\"\",INDEX('B. Lijsten'!$C$17:$F$18, MATCH(Invoeren!$G$27, 'B. Lijsten'!$C$17:$C$18, 0), MATCH('A. Breakdown'!$C24, 'B. Lijsten'!$D$16:$F$16, 0) + 1))","v":""},{"$f":"IF('C. Warmtetechnieken'!O23=\"Nee\",1,0)","v":1},{"$f":"IF(Invoeren!$G$29=\"\",\"\",INDEX('B. Lijsten'!$C$25:$E$26, MATCH(Invoeren!$G$29, 'B. Lijsten'!$C$25:$C$26, 0), MATCH('A. Breakdown'!$AH24, 'B. Lijsten'!$D$24:$E$24, 0) + 1))","v":""},{"$f":"IF('C. Warmtetechnieken'!P23=\"Nee\",1,0)","v":1},{"$f":"IF(W24=0,\"\",IF(Invoeren!$G$28=\"\",\"\",INDEX('B. Lijsten'!$C$21:$E$22,MATCH(Invoeren!$G$28,'B. Lijsten'!$C$21:$C$22,0),MATCH('A. Breakdown'!$AJ24,'B. Lijsten'!$D$20:$E$20,0)+1)))","v":""},1,{"$f":"IF(Invoeren!$G$12=\"\",\"\",INDEX('B. Lijsten'!$C$38:$F$42, MATCH(Invoeren!$G$12, 'B. Lijsten'!$C$38:$C$42, 0), MATCH('A. Breakdown'!$C24, 'B. Lijsten'!$D$37:$F$37, 0) + 1))","v":""},{"$f":"'C. Warmtetechnieken'!G23","v":"LT"},{"$f":"IF(Invoeren!$G$8=\"\",\"\",INDEX('B. Lijsten'!$C$28:$G$30,MATCH(Invoeren!$G$8,'B. Lijsten'!$C$28:$C$30,0),MATCH($AN24,'B. Lijsten'!$D$27:$G$27,0)+1))","v":""},{"$f":"IF(Invoeren!$G$9=\"\",\"\",INDEX('B. Lijsten'!$C$32:$G$36,MATCH(Invoeren!$G$9,'B. Lijsten'!$C$32:$C$36,0),MATCH($AN24,'B. Lijsten'!$D$31:$G$31,0)+1))","v":""},null,{"$f":"VLOOKUP(D24,Table1[[Warmtebron & type net]:[Energiearmoede verergerd?]],16,FALSE)","v":"Middelgrote dorpen en/of compacte wijken"},{"$f":"IF(Invoeren!$G$33=\"\",\"\",INDEX('B. Lijsten'!$C$48:$H$51,MATCH(Invoeren!$G$33,'B. Lijsten'!$C$48:$C$51,0),MATCH($AR24,'B. Lijsten'!$D$47:$H$47,0)+1))","v":""}]
[23,{"$f":"'C. Warmtetechnieken'!A24","v":"Asfaltthermie - Thermische panelen in de weg​ (WKO)"},{"$f":"'C. Warmtetechnieken'!B24","v":"Warmtenet"},"Warmtenet - Asfaltthermie - Thermische panelen in de weg​ (WKO)","Een LT-warmtenet op basis van asfaltthermie, inclusief WKO","Asfaltthermie","Een LT-warmtenet op basis van asfaltthermie, inclusief WKO",null,null,{"$f":"AVERAGE(\nIF(ISNUMBER(AG25) * (AG25<>0), AG25*'B. Lijsten'!$L$9),\nIF(ISNUMBER(AI25) * (AI25<>0), AI25*'B. Lijsten'!$L$11),\nIF(ISNUMBER(AK25) * (AK25<>0), AK25*'B. Lijsten'!$L$10),\nIF(ISNUMBER(AM25) * (AM25<>0), AM25*'B. Lijsten'!$L$5),\nIF(ISNUMBER(AO25) * (AO25<>0), AO25*'B. Lijsten'!$L$3),\nIF(ISNUMBER(AP25) * (AP25<>0), AP25*'B. Lijsten'!$L$4),\nIF(ISNUMBER(AS25) * (AS25<>0), AS25)\n)","v":0},0.7,0,0,null,null,null,null,null,null,null,null,1,{"$f":"IF(AND(AL25=0,Invoeren!$G$28=\"Ja\"),0,1)","v":1},"",{"$f":"IF('C. Warmtetechnieken'!L24=\"Individueel\",1,\nIF('C. Warmtetechnieken'!L24=\"Klein\",\"2 tot 200\",\nIF('C. Warmtetechnieken'!L24=\"Middel\",\"200 tot 500\",\nIF('C. Warmtetechnieken'!L24=\"Middelgroot\",\"500 tot 1500\",\nIF('C. Warmtetechnieken'!L24=\"Groot\",\"1500 tot 5000\",\nIF('C. Warmtetechnieken'!L24=\"Zeer groot\",\"Meer dan 5000\",\n\"\"))))))","v":"200 tot 500"},3,{"$f":"IF(Invoeren!$G$32=1,1,\nIF(Invoeren!$G$32=\"2 tot 200\",2,\nIF(Invoeren!$G$32=\"200 tot 500\",3,\nIF(Invoeren!$G$32=\"500 tot 1500\",4,\nIF(Invoeren!$G$32=\"1500 tot 5000\",5,\nIF(Invoeren!$G$32=\"Meer dan 5000\",6,\n\"\"))))))","v":""},{"$f":"IF(Invoeren!$G$34=\"Ja\",1,0)","v":0},{"$f":"IF(Invoeren!$G$35=1,1,\nIF(Invoeren!$G$35=\"2 tot 200\",2,\nIF(Invoeren!$G$35=\"200 tot 500\",3,\nIF(Invoeren!$G$35=\"500 tot 1500\",4,\nIF(Invoeren!$G$35=\"1500 tot 5000\",5,\nIF(Invoeren!$G$35=\"Meer dan 5000\",6,\n\"\"))))))","v":""},0,null,{"$f":"IF(Invoeren!$G$20=\"\",\"\",IF(Invoeren!$G$29=\"\",\"Geen restwarmtebron\",INDEX('B. Lijsten'!$C$44:$G$46, MATCH(Invoeren!$G$20, 'B. Lijsten'!$C$44:$C$46, 0), MATCH($AE25, 'B. Lijsten'!$D$43:$G$43, 0) + 1)))","v":""},{"$f":"IF(Invoeren!$G$27=\"\",\"\",INDEX('B. Lijsten'!$C$17:$F$18, MATCH(Invoeren!$G$27, 'B. Lijsten'!$C$17:$C$18, 0), MATCH('A. Breakdown'!$C25, 'B. Lijsten'!$D$16:$F$16, 0) + 1))","v":""},{"$f":"IF('C. Warmtetechnieken'!O24=\"Nee\",1,0)","v":1},{"$f":"IF(Invoeren!$G$29=\"\",\"\",INDEX('B. Lijsten'!$C$25:$E$26, MATCH(Invoeren!$G$29, 'B. Lijsten'!$C$25:$C$26, 0), MATCH('A. Breakdown'!$AH25, 'B. Lijsten'!$D$24:$E$24, 0) + 1))","v":""},{"$f":"IF('C. Warmtetechnieken'!P24=\"Nee\",1,0)","v":0},{"$f":"IF(W25=0,\"\",IF(Invoeren!$G$28=\"\",\"\",INDEX('B. Lijsten'!$C$21:$E$22,MATCH(Invoeren!$G$28,'B. Lijsten'!$C$21:$C$22,0),MATCH('A. Breakdown'!$AJ25,'B. Lijsten'!$D$20:$E$20,0)+1)))","v":""},0,{"$f":"IF(Invoeren!$G$12=\"\",\"\",INDEX('B. Lijsten'!$C$38:$F$42, MATCH(Invoeren!$G$12, 'B. Lijsten'!$C$38:$C$42, 0), MATCH('A. Breakdown'!$C25, 'B. Lijsten'!$D$37:$F$37, 0) + 1))","v":""},{"$f":"'C. Warmtetechnieken'!G24","v":"LT"},{"$f":"IF(Invoeren!$G$8=\"\",\"\",INDEX('B. Lijsten'!$C$28:$G$30,MATCH(Invoeren!$G$8,'B. Lijsten'!$C$28:$C$30,0),MATCH($AN25,'B. Lijsten'!$D$27:$G$27,0)+1))","v":""},{"$f":"IF(Invoeren!$G$9=\"\",\"\",INDEX('B. Lijsten'!$C$32:$G$36,MATCH(Invoeren!$G$9,'B. Lijsten'!$C$32:$C$36,0),MATCH($AN25,'B. Lijsten'!$D$31:$G$31,0)+1))","v":""},null,{"$f":"VLOOKUP(D25,Table1[[Warmtebron & type net]:[Energiearmoede verergerd?]],16,FALSE)","v":"Middelgrote dorpen en/of compacte wijken"},{"$f":"IF(Invoeren!$G$33=\"\",\"\",INDEX('B. Lijsten'!$C$48:$H$51,MATCH(Invoeren!$G$33,'B. Lijsten'!$C$48:$C$51,0),MATCH($AR25,'B. Lijsten'!$D$47:$H$47,0)+1))","v":""}]
[24,{"$f":"'C. Warmtetechnieken'!A25","v":"Gesloten bodemenergie​ LT"},{"$f":"'C. Warmtetechnieken'!B25","v":"Warmtenet"},"Warmtenet - Gesloten bodemenergie​ LT","Een LT-warmtenet op basis van een gesloten bodemenergie systeem","Gesloten bodemenergie","Een LT-warmtenet op basis van een gesloten bodemenergie systeem",null,null,{"$f":"AVERAGE(\nIF(ISNUMBER(AG26) * (AG26<>0), AG26*'B. Lijsten'!$L$9),\nIF(ISNUMBER(AI26) * (AI26<>0), AI26*'B. Lijsten'!$L$11),\nIF(ISNUMBER(AK26) * (AK26<>0), AK26*'B. Lijsten'!$L$10),\nIF(ISNUMBER(AM26) * (AM26<>0), AM26*'B. Lijsten'!$L$5),\nIF(ISNUMBER(AO26) * (AO26<>0), AO26*'B. Lijsten'!$L$3),\nIF(ISNUMBER(AP26) * (AP26<>0), AP26*'B. Lijsten'!$L$4),\nIF(ISNUMBER(AS26) * (AS26<>0), AS26)\n)","v":0},1,0,0,null,null,null,null,null,null,null,null,1,{"$f":"IF(AND(AL26=0,Invoeren!$G$28=\"Ja\"),0,1)","v":1},"",{"$f":"IF('C. Warmtetechnieken'!L25=\"Individueel\",1,\nIF('C. Warmtetechnieken'!L25=\"Klein\",\"2 tot 200\",\nIF('C. Warmtetechnieken'!L25=\"Middel\",\"200 tot 500\",\nIF('C. Warmtetechnieken'!L25=\"Middelgroot\",\"500 tot 1500\",\nIF('C. Warmtetechnieken'!L25=\"Groot\",\"1500 tot 5000\",\nIF('C. Warmtetechnieken'!L25=\"Zeer groot\",\"Meer dan 5000\",\n\"\"))))))","v":"2 tot 200"},2,{"$f":"IF(Invoeren!$G$32=1,1,\nIF(Invoeren!$G$32=\"2 tot 200\",2,\nIF(Invoeren!$G$32=\"200 tot 500\",3,\nIF(Invoeren!$G$32=\"500 tot 1500\",4,\nIF(Invoeren!$G$32=\"1500 tot 5000\",5,\nIF(Invoeren!$G$32=\"Meer dan 5000\",6,\n\"\"))))))","v":""},{"$f":"IF(Invoeren!$G$34=\"Ja\",1,0)","v":0},{"$f":"IF(Invoeren!$G$35=1,1,\nIF(Invoeren!$G$35=\"2 tot 200\",2,\nIF(Invoeren!$G$35=\"200 tot 500\",3,\nIF(Invoeren!$G$35=\"500 tot 1500\",4,\nIF(Invoeren!$G$35=\"1500 tot 5000\",5,\nIF(Invoeren!$G$35=\"Meer dan 5000\",6,\n\"\"))))))","v":""},0,null,{"$f":"IF(Invoeren!$G$20=\"\",\"\",IF(Invoeren!$G$29=\"\",\"Geen restwarmtebron\",INDEX('B. Lijsten'!$C$44:$G$46, MATCH(Invoeren!$G$20, 'B. Lijsten'!$C$44:$C$46, 0), MATCH($AE26, 'B. Lijsten'!$D$43:$G$43, 0) + 1)))","v":""},{"$f":"IF(Invoeren!$G$27=\"\",\"\",INDEX('B. Lijsten'!$C$17:$F$18, MATCH(Invoeren!$G$27, 'B. Lijsten'!$C$17:$C$18, 0), MATCH('A. Breakdown'!$C26, 'B. Lijsten'!$D$16:$F$16, 0) + 1))","v":""},{"$f":"IF('C. Warmtetechnieken'!O25=\"Nee\",1,0)","v":1},{"$f":"IF(Invoeren!$G$29=\"\",\"\",INDEX('B. Lijsten'!$C$25:$E$26, MATCH(Invoeren!$G$29, 'B. Lijsten'!$C$25:$C$26, 0), MATCH('A. Breakdown'!$AH26, 'B. Lijsten'!$D$24:$E$24, 0) + 1))","v":""},{"$f":"IF('C. Warmtetechnieken'!P25=\"Nee\",1,0)","v":0},{"$f":"IF(W26=0,\"\",IF(Invoeren!$G$28=\"\",\"\",INDEX('B. Lijsten'!$C$21:$E$22,MATCH(Invoeren!$G$28,'B. Lijsten'!$C$21:$C$22,0),MATCH('A. Breakdown'!$AJ26,'B. Lijsten'!$D$20:$E$20,0)+1)))","v":""},1,{"$f":"IF(Invoeren!$G$12=\"\",\"\",INDEX('B. Lijsten'!$C$38:$F$42, MATCH(Invoeren!$G$12, 'B. Lijsten'!$C$38:$C$42, 0), MATCH('A. Breakdown'!$C26, 'B. Lijsten'!$D$37:$F$37, 0) + 1))","v":""},{"$f":"'C. Warmtetechnieken'!G25","v":"LT"},{"$f":"IF(Invoeren!$G$8=\"\",\"\",INDEX('B. Lijsten'!$C$28:$G$30,MATCH(Invoeren!$G$8,'B. Lijsten'!$C$28:$C$30,0),MATCH($AN26,'B. Lijsten'!$D$27:$G$27,0)+1))","v":""},{"$f":"IF(Invoeren!$G$9=\"\",\"\",INDEX('B. Lijsten'!$C$32:$G$36,MATCH(Invoeren!$G$9,'B. Lijsten'!$C$32:$C$36,0),MATCH($AN26,'B. Lijsten'!$D$31:$G$31,0)+1))","v":""},null,{"$f":"VLOOKUP(D26,Table1[[Warmtebron & type net]:[Energiearmoede verergerd?]],16,FALSE)","v":"Middelgrote dorpen en/of compacte wijken"},{"$f":"IF(Invoeren!$G$33=\"\",\"\",INDEX('B. Lijsten'!$C$48:$H$51,MATCH(Invoeren!$G$33,'B. Lijsten'!$C$48:$C$51,0),MATCH($AR26,'B. Lijsten'!$D$47:$H$47,0)+1))","v":""}]
[25,{"$f":"'C. Warmtetechnieken'!A26","v":"Sportveld thermie"},{"$f":"'C. Warmtetechnieken'!B26","v":"Bronnet"},"Bronnet - Sportveld thermie","Een bronnet op basis van sportveld thermie","Sportveld thermie","Een bronnet op basis van sportveld thermie",null,null,{"$f":"AVERAGE(\nIF(ISNUMBER(AG27) * (AG27<>0), AG27*'B. Lijsten'!$L$9),\nIF(ISNUMBER(AI27) * (AI27<>0), AI27*'B. Lijsten'!$L$11),\nIF(ISNUMBER(AK27) * (AK27<>0), AK27*'B. Lijsten'!$L$10),\nIF(ISNUMBER(AM27) * (AM27<>0), AM27*'B. Lijsten'!$L$5),\nIF(ISNUMBER(AO27) * (AO27<>0), AO27*'B. Lijsten'!$L$3),\nIF(ISNUMBER(AP27) * (AP27<>0), AP27*'B. Lijsten'!$L$4),\nIF(ISNUMBER(AS27) * (AS27<>0), AS27)\n)","v":0},0.8,0,0,null,null,null,null,null,null,null,null,1,{"$f":"IF(AND(AL27=0,Invoeren!$G$28=\"Ja\"),0,1)","v":1},"",{"$f":"IF('C. Warmtetechnieken'!L26=\"Individueel\",1,\nIF('C. Warmtetechnieken'!L26=\"Klein\",\"2 tot 200\",\nIF('C. Warmtetechnieken'!L26=\"Middel\",\"200 tot 500\",\nIF('C. Warmtetechnieken'!L26=\"Middelgroot\",\"500 tot 1500\",\nIF('C. Warmtetechnieken'!L26=\"Groot\",\"1500 tot 5000\",\nIF('C. Warmtetechnieken'!L26=\"Zeer groot\",\"Meer dan 5000\",\n\"\"))))))","v":"200 tot 500"},3,{"$f":"IF(Invoeren!$G$32=1,1,\nIF(Invoeren!$G$32=\"2 tot 200\",2,\nIF(Invoeren!$G$32=\"200 tot 500\",3,\nIF(Invoeren!$G$32=\"500 tot 1500\",4,\nIF(Invoeren!$G$32=\"1500 tot 5000\",5,\nIF(Invoeren!$G$32=\"Meer dan 5000\",6,\n\"\"))))))","v":""},{"$f":"IF(Invoeren!$G$34=\"Ja\",1,0)","v":0},{"$f":"IF(Invoeren!$G$35=1,1,\nIF(Invoeren!$G$35=\"2 tot 200\",2,\nIF(Invoeren!$G$35=\"200 tot 500\",3,\nIF(Invoeren!$G$35=\"500 tot 1500\",4,\nIF(Invoeren!$G$35=\"1500 tot 5000\",5,\nIF(Invoeren!$G$35=\"Meer dan 5000\",6,\n\"\"))))))","v":""},0,null,{"$f":"IF(Invoeren!$G$20=\"\",\"\",IF(Invoeren!$G$29=\"\",\"Geen restwarmtebron\",INDEX('B. Lijsten'!$C$44:$G$46, MATCH(Invoeren!$G$20, 'B. Lijsten'!$C$44:$C$46, 0), MATCH($AE27, 'B. Lijsten'!$D$43:$G$43, 0) + 1)))","v":""},{"$f":"IF(Invoeren!$G$27=\"\",\"\",INDEX('B. Lijsten'!$C$17:$F$18, MATCH(Invoeren!$G$27, 'B. Lijsten'!$C$17:$C$18, 0), MATCH('A. Breakdown'!$C27, 'B. Lijsten'!$D$16:$F$16, 0) + 1))","v":""},{"$f":"IF('C. Warmtetechnieken'!O26=\"Nee\",1,0)","v":1},{"$f":"IF(Invoeren!$G$29=\"\",\"\",INDEX('B. Lijsten'!$C$25:$E$26, MATCH(Invoeren!$G$29, 'B. Lijsten'!$C$25:$C$26, 0), MATCH('A. Breakdown'!$AH27, 'B. Lijsten'!$D$24:$E$24, 0) + 1))","v":""},{"$f":"IF('C. Warmtetechnieken'!P26=\"Nee\",1,0)","v":1},{"$f":"IF(W27=0,\"\",IF(Invoeren!$G$28=\"\",\"\",INDEX('B. Lijsten'!$C$21:$E$22,MATCH(Invoeren!$G$28,'B. Lijsten'!$C$21:$C$22,0),MATCH('A. Breakdown'!$AJ27,'B. Lijsten'!$D$20:$E$20,0)+1)))","v":""},1,{"$f":"IF(Invoeren!$G$12=\"\",\"\",INDEX('B. Lijsten'!$C$38:$F$42, MATCH(Invoeren!$G$12, 'B. Lijsten'!$C$38:$C$42, 0), MATCH('A. Breakdown'!$C27, 'B. Lijsten'!$D$37:$F$37, 0) + 1))","v":""},{"$f":"'C. Warmtetechnieken'!G26","v":"ZLT"},{"$f":"IF(Invoeren!$G$8=\"\",\"\",INDEX('B. Lijsten'!$C$28:$G$30,MATCH(Invoeren!$G$8,'B. Lijsten'!$C$28:$C$30,0),MATCH($AN27,'B. Lijsten'!$D$27:$G$27,0)+1))","v":""},{"$f":"IF(Invoeren!$G$9=\"\",\"\",INDEX('B. Lijsten'!$C$32:$G$36,MATCH(Invoeren!$G$9,'B. Lijsten'!$C$32:$C$36,0),MATCH($AN27,'B. Lijsten'!$D$31:$G$31,0)+1))","v":""},null,{"$f":"VLOOKUP(D27,Table1[[Warmtebron & type net]:[Energiearmoede verergerd?]],16,FALSE)","v":"Middelgrote dorpen en/of compacte wijken"},{"$f":"IF(Invoeren!$G$33=\"\",\"\",INDEX('B. Lijsten'!$C$48:$H$51,MATCH(Invoeren!$G$33,'B. Lijsten'!$C$48:$C$51,0),MATCH($AR27,'B. Lijsten'!$D$47:$H$47,0)+1))","v":""}]
[26,{"$f":"'C. Warmtetechnieken'!A27","v":"Sportveld thermie LT (met WKO)"},{"$f":"'C. Warmtetechnieken'!B27","v":"Warmtenet"},"Warmtenet - Sportveld thermie LT (met WKO)","Een LT-warmtenet op basis van sportveld thermie, inclusief WKO","Sportveld thermie","Een LT-warmtenet op basis van sportveld thermie, inclusief WKO",null,null,{"$f":"AVERAGE(\nIF(ISNUMBER(AG28) * (AG28<>0), AG28*'B. Lijsten'!$L$9),\nIF(ISNUMBER(AI28) * (AI28<>0), AI28*'B. Lijsten'!$L$11),\nIF(ISNUMBER(AK28) * (AK28<>0), AK28*'B. Lijsten'!$L$10),\nIF(ISNUMBER(AM28) * (AM28<>0), AM28*'B. Lijsten'!$L$5),\nIF(ISNUMBER(AO28) * (AO28<>0), AO28*'B. Lijsten'!$L$3),\nIF(ISNUMBER(AP28) * (AP28<>0), AP28*'B. Lijsten'!$L$4),\nIF(ISNUMBER(AS28) * (AS28<>0), AS28)\n)","v":0},0.8,0,0,null,null,null,null,null,null,null,null,1,{"$f":"IF(AND(AL28=0,Invoeren!$G$28=\"Ja\"),0,1)","v":1},"",{"$f":"IF('C. Warmtetechnieken'!L27=\"Individueel\",1,\nIF('C. Warmtetechnieken'!L27=\"Klein\",\"2 tot 200\",\nIF('C. Warmtetechnieken'!L27=\"Middel\",\"200 tot 500\",\nIF('C. Warmtetechnieken'!L27=\"Middelgroot\",\"500 tot 1500\",\nIF('C. Warmtetechnieken'!L27=\"Groot\",\"1500 tot 5000\",\nIF('C. Warmtetechnieken'!L27=\"Zeer groot\",\"Meer dan 5000\",\n\"\"))))))","v":"200 tot 500"},3,{"$f":"IF(Invoeren!$G$32=1,1,\nIF(Invoeren!$G$32=\"2 tot 200\",2,\nIF(Invoeren!$G$32=\"200 tot 500\",3,\nIF(Invoeren!$G$32=\"500 tot 1500\",4,\nIF(Invoeren!$G$32=\"1500 tot 5000\",5,\nIF(Invoeren!$G$32=\"Meer dan 5000\",6,\n\"\"))))))","v":""},{"$f":"IF(Invoeren!$G$34=\"Ja\",1,0)","v":0},{"$f":"IF(Invoeren!$G$35=1,1,\nIF(Invoeren!$G$35=\"2 tot 200\",2,\nIF(Invoeren!$G$35=\"200 tot 500\",3,\nIF(Invoeren!$G$35=\"500 tot 1500\",4,\nIF(Invoeren!$G$35=\"1500 tot 5000\",5,\nIF(Invoeren!$G$35=\"Meer dan 5000\",6,\n\"\"))))))","v":""},0,null,{"$f":"IF(Invoeren!$G$20=\"\",\"\",IF(Invoeren!$G$29=\"\",\"Geen restwarmtebron\",INDEX('B. Lijsten'!$C$44:$G$46, MATCH(Invoeren!$G$20, 'B. Lijsten'!$C$44:$C$46, 0), MATCH($AE28, 'B. Lijsten'!$D$43:$G$43, 0) + 1)))","v":""},{"$f":"IF(Invoeren!$G$27=\"\",\"\",INDEX('B. Lijsten'!$C$17:$F$18, MATCH(Invoeren!$G$27, 'B. Lijsten'!$C$17:$C$18, 0), MATCH('A. Breakdown'!$C28, 'B. Lijsten'!$D$16:$F$16, 0) + 1))","v":""},{"$f":"IF('C. Warmtetechnieken'!O27=\"Nee\",1,0)","v":1},{"$f":"IF(Invoeren!$G$29=\"\",\"\",INDEX('B. Lijsten'!$C$25:$E$26, MATCH(Invoeren!$G$29, 'B. Lijsten'!$C$25:$C$26, 0), MATCH('A. Breakdown'!$AH28, 'B. Lijsten'!$D$24:$E$24, 0) + 1))","v":""},{"$f":"IF('C. Warmtetechnieken'!P27=\"Nee\",1,0)","v":0},{"$f":"IF(W28=0,\"\",IF(Invoeren!$G$28=\"\",\"\",INDEX('B. Lijsten'!$C$21:$E$22,MATCH(Invoeren!$G$28,'B. Lijsten'!$C$21:$C$22,0),MATCH('A. Breakdown'!$AJ28,'B. Lijsten'!$D$20:$E$20,0)+1)))","v":""},0,{"$f":"IF(Invoeren!$G$12=\"\",\"\",INDEX('B. Lijsten'!$C$38:$F$42, MATCH(Invoeren!$G$12, 'B. Lijsten'!$C$38:$C$42, 0), MATCH('A. Breakdown'!$C28, 'B. Lijsten'!$D$37:$F$37, 0) + 1))","v":""},{"$f":"'C. Warmtetechnieken'!G27","v":"LT"},{"$f":"IF(Invoeren!$G$8=\"\",\"\",INDEX('B. Lijsten'!$C$28:$G$30,MATCH(Invoeren!$G$8,'B. Lijsten'!$C$28:$C$30,0),MATCH($AN28,'B. Lijsten'!$D$27:$G$27,0)+1))","v":""},{"$f":"IF(Invoeren!$G$9=\"\",\"\",INDEX('B. Lijsten'!$C$32:$G$36,MATCH(Invoeren!$G$9,'B. Lijsten'!$C$32:$C$36,0),MATCH($AN28,'B. Lijsten'!$D$31:$G$31,0)+1))","v":""},null,{"$f":"VLOOKUP(D28,Table1[[Warmtebron & type net]:[Energiearmoede verergerd?]],16,FALSE)","v":"Middelgrote dorpen en/of compacte wijken"},{"$f":"IF(Invoeren!$G$33=\"\",\"\",INDEX('B. Lijsten'!$C$48:$H$51,MATCH(Invoeren!$G$33,'B. Lijsten'!$C$48:$C$51,0),MATCH($AR28,'B. Lijsten'!$D$47:$H$47,0)+1))","v":""}]
[27,{"$f":"'C. Warmtetechnieken'!A28","v":"Thermische energie uit afvalwater - leidingen (TEA)"},{"$f":"'C. Warmtetechnieken'!B28","v":"Bronnet"},"Bronnet - Thermische energie uit afvalwater - leidingen (TEA)","Een bronnet op basis van afvalwater aquathermie uit leidingen (TEA)","Afvalwater aquathermie (TEA)","Een bronnet op basis van afvalwater aquathermie uit leidingen (TEA)",null,null,{"$f":"AVERAGE(\nIF(ISNUMBER(AG29) * (AG29<>0), AG29*'B. Lijsten'!$L$9),\nIF(ISNUMBER(AI29) * (AI29<>0), AI29*'B. Lijsten'!$L$11),\nIF(ISNUMBER(AK29) * (AK29<>0), AK29*'B. Lijsten'!$L$10),\nIF(ISNUMBER(AM29) * (AM29<>0), AM29*'B. Lijsten'!$L$5),\nIF(ISNUMBER(AO29) * (AO29<>0), AO29*'B. Lijsten'!$L$3),\nIF(ISNUMBER(AP29) * (AP29<>0), AP29*'B. Lijsten'!$L$4),\nIF(ISNUMBER(AS29) * (AS29<>0), AS29)\n)","v":0},1,0,0,{"$f":"IF(Invoeren!$G$15=\"Ja\",1,0)","v":0},null,null,{"$f":"IF(Invoeren!$G$19=\"Ja\",1,0)","v":0},null,{"$f":"IF(Invoeren!$G$23=\"Ja\",1,0)","v":0},null,null,null,{"$f":"IF(AND(AL29=0,Invoeren!$G$28=\"Ja\"),0,1)","v":1},"",{"$f":"IF('C. Warmtetechnieken'!L28=\"Individueel\",1,\nIF('C. Warmtetechnieken'!L28=\"Klein\",\"2 tot 200\",\nIF('C. Warmtetechnieken'!L28=\"Middel\",\"200 tot 500\",\nIF('C. Warmtetechnieken'!L28=\"Middelgroot\",\"500 tot 1500\",\nIF('C. Warmtetechnieken'!L28=\"Groot\",\"1500 tot 5000\",\nIF('C. Warmtetechnieken'!L28=\"Zeer groot\",\"Meer dan 5000\",\n\"\"))))))","v":"200 tot 500"},3,{"$f":"IF(Invoeren!$G$32=1,1,\nIF(Invoeren!$G$32=\"2 tot 200\",2,\nIF(Invoeren!$G$32=\"200 tot 500\",3,\nIF(Invoeren!$G$32=\"500 tot 1500\",4,\nIF(Invoeren!$G$32=\"1500 tot 5000\",5,\nIF(Invoeren!$G$32=\"Meer dan 5000\",6,\n\"\"))))))","v":""},{"$f":"IF(Invoeren!$G$34=\"Ja\",1,0)","v":0},{"$f":"IF(Invoeren!$G$35=1,1,\nIF(Invoeren!$G$35=\"2 tot 200\",2,\nIF(Invoeren!$G$35=\"200 tot 500\",3,\nIF(Invoeren!$G$35=\"500 tot 1500\",4,\nIF(Invoeren!$G$35=\"1500 tot 5000\",5,\nIF(Invoeren!$G$35=\"Meer dan 5000\",6,\n\"\"))))))","v":""},0,null,{"$f":"IF(Invoeren!$G$20=\"\",\"\",IF(Invoeren!$G$29=\"\",\"Geen restwarmtebron\",INDEX('B. Lijsten'!$C$44:$G$46, MATCH(Invoeren!$G$20, 'B. Lijsten'!$C$44:$C$46, 0), MATCH($AE29, 'B. Lijsten'!$D$43:$G$43, 0) + 1)))","v":""},{"$f":"IF(Invoeren!$G$27=\"\",\"\",INDEX('B. Lijsten'!$C$17:$F$18, MATCH(Invoeren!$G$27, 'B. Lijsten'!$C$17:$C$18, 0), MATCH('A. Breakdown'!$C29, 'B. Lijsten'!$D$16:$F$16, 0) + 1))","v":""},{"$f":"IF('C. Warmtetechnieken'!O28=\"Nee\",1,0)","v":1},{"$f":"IF(Invoeren!$G$29=\"\",\"\",INDEX('B. Lijsten'!$C$25:$E$26, MATCH(Invoeren!$G$29, 'B. Lijsten'!$C$25:$C$26, 0), MATCH('A. Breakdown'!$AH29, 'B. Lijsten'!$D$24:$E$24, 0) + 1))","v":""},{"$f":"IF('C. Warmtetechnieken'!P28=\"Nee\",1,0)","v":0},{"$f":"IF(W29=0,\"\",IF(Invoeren!$G$28=\"\",\"\",INDEX('B. Lijsten'!$C$21:$E$22,MATCH(Invoeren!$G$28,'B. Lijsten'!$C$21:$C$22,0),MATCH('A. Breakdown'!$AJ29,'B. Lijsten'!$D$20:$E$20,0)+1)))","v":""},0,{"$f":"IF(Invoeren!$G$12=\"\",\"\",INDEX('B. Lijsten'!$C$38:$F$42, MATCH(Invoeren!$G$12, 'B. Lijsten'!$C$38:$C$42, 0), MATCH('A. Breakdown'!$C29, 'B. Lijsten'!$D$37:$F$37, 0) + 1))","v":""},{"$f":"'C. Warmtetechnieken'!G28","v":"ZLT"},{"$f":"IF(Invoeren!$G$8=\"\",\"\",INDEX('B. Lijsten'!$C$28:$G$30,MATCH(Invoeren!$G$8,'B. Lijsten'!$C$28:$C$30,0),MATCH($AN29,'B. Lijsten'!$D$27:$G$27,0)+1))","v":""},{"$f":"IF(Invoeren!$G$9=\"\",\"\",INDEX('B. Lijsten'!$C$32:$G$36,MATCH(Invoeren!$G$9,'B. Lijsten'!$C$32:$C$36,0),MATCH($AN29,'B. Lijsten'!$D$31:$G$31,0)+1))","v":""},null,{"$f":"VLOOKUP(D29,Table1[[Warmtebron & type net]:[Energiearmoede verergerd?]],16,FALSE)","v":"Middelgrote dorpen en/of compacte wijken"},{"$f":"IF(Invoeren!$G$33=\"\",\"\",INDEX('B. Lijsten'!$C$48:$H$51,MATCH(Invoeren!$G$33,'B. Lijsten'!$C$48:$C$51,0),MATCH($AR29,'B. Lijsten'!$D$47:$H$47,0)+1))","v":""}]
[28,{"$f":"'C. Warmtetechnieken'!A29","v":"Thermische energie uit afvalwater - leidingen (TEA)​ LT"},{"$f":"'C. Warmtetechnieken'!B29","v":"Warmtenet"},"Warmtenet - Thermische energie uit afvalwater - leidingen (TEA)​ LT","Een LT-warmtenet op basis van afvalwater aquathermie (TEA) uit leidingen","Afvalwater aquathermie (TEA)","Een LT-warmtenet op basis van afvalwater aquathermie (TEA) uit leidingen",null,null,{"$f":"AVERAGE(\nIF(ISNUMBER(AG30) * (AG30<>0), AG30*'B. Lijsten'!$L$9),\nIF(ISNUMBER(AI30) * (AI30<>0), AI30*'B. Lijsten'!$L$11),\nIF(ISNUMBER(AK30) * (AK30<>0), AK30*'B. Lijsten'!$L$10),\nIF(ISNUMBER(AM30) * (AM30<>0), AM30*'B. Lijsten'!$L$5),\nIF(ISNUMBER(AO30) * (AO30<>0), AO30*'B. Lijsten'!$L$3),\nIF(ISNUMBER(AP30) * (AP30<>0), AP30*'B. Lijsten'!$L$4),\nIF(ISNUMBER(AS30) * (AS30<>0), AS30)\n)","v":0},1,0,0,{"$f":"IF(Invoeren!$G$15=\"Ja\",1,0)","v":0},null,null,{"$f":"IF(Invoeren!$G$19=\"Ja\",1,0)","v":0},null,{"$f":"IF(Invoeren!$G$23=\"Ja\",1,0)","v":0},null,null,null,{"$f":"IF(AND(AL30=0,Invoeren!$G$28=\"Ja\"),0,1)","v":1},"",{"$f":"IF('C. Warmtetechnieken'!L29=\"Individueel\",1,\nIF('C. Warmtetechnieken'!L29=\"Klein\",\"2 tot 200\",\nIF('C. Warmtetechnieken'!L29=\"Middel\",\"200 tot 500\",\nIF('C. Warmtetechnieken'!L29=\"Middelgroot\",\"500 tot 1500\",\nIF('C. Warmtetechnieken'!L29=\"Groot\",\"1500 tot 5000\",\nIF('C. Warmtetechnieken'!L29=\"Zeer groot\",\"Meer dan 5000\",\n\"\"))))))","v":"200 tot 500"},3,{"$f":"IF(Invoeren!$G$32=1,1,\nIF(Invoeren!$G$32=\"2 tot 200\",2,\nIF(Invoeren!$G$32=\"200 tot 500\",3,\nIF(Invoeren!$G$32=\"500 tot 1500\",4,\nIF(Invoeren!$G$32=\"1500 tot 5000\",5,\nIF(Invoeren!$G$32=\"Meer dan 5000\",6,\n\"\"))))))","v":""},{"$f":"IF(Invoeren!$G$34=\"Ja\",1,0)","v":0},{"$f":"IF(Invoeren!$G$35=1,1,\nIF(Invoeren!$G$35=\"2 tot 200\",2,\nIF(Invoeren!$G$35=\"200 tot 500\",3,\nIF(Invoeren!$G$35=\"500 tot 1500\",4,\nIF(Invoeren!$G$35=\"1500 tot 5000\",5,\nIF(Invoeren!$G$35=\"Meer dan 5000\",6,\n\"\"))))))","v":""},0,null,{"$f":"IF(Invoeren!$G$20=\"\",\"\",IF(Invoeren!$G$29=\"\",\"Geen restwarmtebron\",INDEX('B. Lijsten'!$C$44:$G$46, MATCH(Invoeren!$G$20, 'B. Lijsten'!$C$44:$C$46, 0), MATCH($AE30, 'B. Lijsten'!$D$43:$G$43, 0) + 1)))","v":""},{"$f":"IF(Invoeren!$G$27=\"\",\"\",INDEX('B. Lijsten'!$C$17:$F$18, MATCH(Invoeren!$G$27, 'B. Lijsten'!$C$17:$C$18, 0), MATCH('A. Breakdown'!$C30, 'B. Lijsten'!$D$16:$F$16, 0) + 1))","v":""},{"$f":"IF('C. Warmtetechnieken'!O29=\"Nee\",1,0)","v":1},{"$f":"IF(Invoeren!$G$29=\"\",\"\",INDEX('B. Lijsten'!$C$25:$E$26, MATCH(Invoeren!$G$29, 'B. Lijsten'!$C$25:$C$26, 0), MATCH('A. Breakdown'!$AH30, 'B. Lijsten'!$D$24:$E$24, 0) + 1))","v":""},{"$f":"IF('C. Warmtetechnieken'!P29=\"Nee\",1,0)","v":0},{"$f":"IF(W30=0,\"\",IF(Invoeren!$G$28=\"\",\"\",INDEX('B. Lijsten'!$C$21:$E$22,MATCH(Invoeren!$G$28,'B. Lijsten'!$C$21:$C$22,0),MATCH('A. Breakdown'!$AJ30,'B. Lijsten'!$D$20:$E$20,0)+1)))","v":""},0,{"$f":"IF(Invoeren!$G$12=\"\",\"\",INDEX('B. Lijsten'!$C$38:$F$42, MATCH(Invoeren!$G$12, 'B. Lijsten'!$C$38:$C$42, 0), MATCH('A. Breakdown'!$C30, 'B. Lijsten'!$D$37:$F$37, 0) + 1))","v":""},{"$f":"'C. Warmtetechnieken'!G29","v":"LT"},{"$f":"IF(Invoeren!$G$8=\"\",\"\",INDEX('B. Lijsten'!$C$28:$G$30,MATCH(Invoeren!$G$8,'B. Lijsten'!$C$28:$C$30,0),MATCH($AN30,'B. Lijsten'!$D$27:$G$27,0)+1))","v":""},{"$f":"IF(Invoeren!$G$9=\"\",\"\",INDEX('B. Lijsten'!$C$32:$G$36,MATCH(Invoeren!$G$9,'B. Lijsten'!$C$32:$C$36,0),MATCH($AN30,'B. Lijsten'!$D$31:$G$31,0)+1))","v":""},null,{"$f":"VLOOKUP(D30,Table1[[Warmtebron & type net]:[Energiearmoede verergerd?]],16,FALSE)","v":"Middelgrote dorpen en/of compacte wijken"},{"$f":"IF(Invoeren!$G$33=\"\",\"\",INDEX('B. Lijsten'!$C$48:$H$51,MATCH(Invoeren!$G$33,'B. Lijsten'!$C$48:$C$51,0),MATCH($AR30,'B. Lijsten'!$D$47:$H$47,0)+1))","v":""}]
[29,{"$f":"'C. Warmtetechnieken'!A30","v":"Thermische energie uit afvalwater - RWZI (TEA)"},{"$f":"'C. Warmtetechnieken'!B30","v":"Bronnet"},"Bronnet - Thermische energie uit afvalwater - RWZI (TEA)","Een bronnet op basis van afvalwater aquathermie (TEA) uit de RWZI","Afvalwater aquathermie (TEA)","Een bronnet op basis van afvalwater aquathermie (TEA) uit de RWZI",null,null,{"$f":"AVERAGE(\nIF(ISNUMBER(AG31) * (AG31<>0), AG31*'B. Lijsten'!$L$9),\nIF(ISNUMBER(AI31) * (AI31<>0), AI31*'B. Lijsten'!$L$11),\nIF(ISNUMBER(AK31) * (AK31<>0), AK31*'B. Lijsten'!$L$10),\nIF(ISNUMBER(AM31) * (AM31<>0), AM31*'B. Lijsten'!$L$5),\nIF(ISNUMBER(AO31) * (AO31<>0), AO31*'B. Lijsten'!$L$3),\nIF(ISNUMBER(AP31) * (AP31<>0), AP31*'B. Lijsten'!$L$4),\nIF(ISNUMBER(AS31) * (AS31<>0), AS31)\n)","v":0},1,0,0,{"$f":"IF(Invoeren!$G$15=\"Ja\",1,0)","v":0},null,null,{"$f":"IF(Invoeren!$G$19=\"Ja\",1,0)","v":0},null,{"$f":"IF(Invoeren!$G$23=\"Ja\",1,0)","v":0},null,null,null,{"$f":"IF(AND(AL31=0,Invoeren!$G$28=\"Ja\"),0,1)","v":1},"",{"$f":"IF('C. Warmtetechnieken'!L30=\"Individueel\",1,\nIF('C. Warmtetechnieken'!L30=\"Klein\",\"2 tot 200\",\nIF('C. Warmtetechnieken'!L30=\"Middel\",\"200 tot 500\",\nIF('C. Warmtetechnieken'!L30=\"Middelgroot\",\"500 tot 1500\",\nIF('C. Warmtetechnieken'!L30=\"Groot\",\"1500 tot 5000\",\nIF('C. Warmtetechnieken'!L30=\"Zeer groot\",\"Meer dan 5000\",\n\"\"))))))","v":"200 tot 500"},3,{"$f":"IF(Invoeren!$G$32=1,1,\nIF(Invoeren!$G$32=\"2 tot 200\",2,\nIF(Invoeren!$G$32=\"200 tot 500\",3,\nIF(Invoeren!$G$32=\"500 tot 1500\",4,\nIF(Invoeren!$G$32=\"1500 tot 5000\",5,\nIF(Invoeren!$G$32=\"Meer dan 5000\",6,\n\"\"))))))","v":""},{"$f":"IF(Invoeren!$G$34=\"Ja\",1,0)","v":0},{"$f":"IF(Invoeren!$G$35=1,1,\nIF(Invoeren!$G$35=\"2 tot 200\",2,\nIF(Invoeren!$G$35=\"200 tot 500\",3,\nIF(Invoeren!$G$35=\"500 tot 1500\",4,\nIF(Invoeren!$G$35=\"1500 tot 5000\",5,\nIF(Invoeren!$G$35=\"Meer dan 5000\",6,\n\"\"))))))","v":""},0,null,{"$f":"IF(Invoeren!$G$20=\"\",\"\",IF(Invoeren!$G$29=\"\",\"Geen restwarmtebron\",INDEX('B. Lijsten'!$C$44:$G$46, MATCH(Invoeren!$G$20, 'B. Lijsten'!$C$44:$C$46, 0), MATCH($AE31, 'B. Lijsten'!$D$43:$G$43, 0) + 1)))","v":""},{"$f":"IF(Invoeren!$G$27=\"\",\"\",INDEX('B. Lijsten'!$C$17:$F$18, MATCH(Invoeren!$G$27, 'B. Lijsten'!$C$17:$C$18, 0), MATCH('A. Breakdown'!$C31, 'B. Lijsten'!$D$16:$F$16, 0) + 1))","v":""},{"$f":"IF('C. Warmtetechnieken'!O30=\"Nee\",1,0)","v":1},{"$f":"IF(Invoeren!$G$29=\"\",\"\",INDEX('B. Lijsten'!$C$25:$E$26, MATCH(Invoeren!$G$29, 'B. Lijsten'!$C$25:$C$26, 0), MATCH('A. Breakdown'!$AH31, 'B. Lijsten'!$D$24:$E$24, 0) + 1))","v":""},{"$f":"IF('C. Warmtetechnieken'!P30=\"Nee\",1,0)","v":0},{"$f":"IF(W31=0,\"\",IF(Invoeren!$G$28=\"\",\"\",INDEX('B. Lijsten'!$C$21:$E$22,MATCH(Invoeren!$G$28,'B. Lijsten'!$C$21:$C$22,0),MATCH('A. Breakdown'!$AJ31,'B. Lijsten'!$D$20:$E$20,0)+1)))","v":""},1,{"$f":"IF(Invoeren!$G$12=\"\",\"\",INDEX('B. Lijsten'!$C$38:$F$42, MATCH(Invoeren!$G$12, 'B. Lijsten'!$C$38:$C$42, 0), MATCH('A. Breakdown'!$C31, 'B. Lijsten'!$D$37:$F$37, 0) + 1))","v":""},{"$f":"'C. Warmtetechnieken'!G30","v":"ZLT"},{"$f":"IF(Invoeren!$G$8=\"\",\"\",INDEX('B. Lijsten'!$C$28:$G$30,MATCH(Invoeren!$G$8,'B. Lijsten'!$C$28:$C$30,0),MATCH($AN31,'B. Lijsten'!$D$27:$G$27,0)+1))","v":""},{"$f":"IF(Invoeren!$G$9=\"\",\"\",INDEX('B. Lijsten'!$C$32:$G$36,MATCH(Invoeren!$G$9,'B. Lijsten'!$C$32:$C$36,0),MATCH($AN31,'B. Lijsten'!$D$31:$G$31,0)+1))","v":""},null,{"$f":"VLOOKUP(D31,Table1[[Warmtebron & type net]:[Energiearmoede verergerd?]],16,FALSE)","v":"Middelgrote dorpen en/of compacte wijken"},{"$f":"IF(Invoeren!$G$33=\"\",\"\",INDEX('B. Lijsten'!$C$48:$H$51,MATCH(Invoeren!$G$33,'B. Lijsten'!$C$48:$C$51,0),MATCH($AR31,'B. Lijsten'!$D$47:$H$47,0)+1))","v":""}]
[30,{"$f":"'C. Warmtetechnieken'!A31","v":"Thermische energie uit afvalwater - RWZI (TEA)​ + WKO"},{"$f":"'C. Warmtetechnieken'!B31","v":"Bronnet"},"Bronnet - Thermische energie uit afvalwater - RWZI (TEA)​ + WKO","Een bronnet op basis van afvalwater aquathermie (TEA) uit de RWZI, inclusief WKO","Afvalwater aquathermie (TEA)","Een bronnet op basis van afvalwater aquathermie (TEA) uit de RWZI, inclusief WKO",null,null,{"$f":"AVERAGE(\nIF(ISNUMBER(AG32) * (AG32<>0), AG32*'B. Lijsten'!$L$9),\nIF(ISNUMBER(AI32) * (AI32<>0), AI32*'B. Lijsten'!$L$11),\nIF(ISNUMBER(AK32) * (AK32<>0), AK32*'B. Lijsten'!$L$10),\nIF(ISNUMBER(AM32) * (AM32<>0), AM32*'B. Lijsten'!$L$5),\nIF(ISNUMBER(AO32) * (AO32<>0), AO32*'B. Lijsten'!$L$3),\nIF(ISNUMBER(AP32) * (AP32<>0), AP32*'B. Lijsten'!$L$4),\nIF(ISNUMBER(AS32) * (AS32<>0), AS32)\n)","v":0},1,0,0,{"$f":"IF(Invoeren!$G$15=\"Ja\",1,0)","v":0},null,null,{"$f":"IF(Invoeren!$G$19=\"Ja\",1,0)","v":0},null,{"$f":"IF(Invoeren!$G$23=\"Ja\",1,0)","v":0},null,null,null,{"$f":"IF(AND(AL32=0,Invoeren!$G$28=\"Ja\"),0,1)","v":1},"",{"$f":"IF('C. Warmtetechnieken'!L31=\"Individueel\",1,\nIF('C. Warmtetechnieken'!L31=\"Klein\",\"2 tot 200\",\nIF('C. Warmtetechnieken'!L31=\"Middel\",\"200 tot 500\",\nIF('C. Warmtetechnieken'!L31=\"Middelgroot\",\"500 tot 1500\",\nIF('C. Warmtetechnieken'!L31=\"Groot\",\"1500 tot 5000\",\nIF('C. Warmtetechnieken'!L31=\"Zeer groot\",\"Meer dan 5000\",\n\"\"))))))","v":"200 tot 500"},3,{"$f":"IF(Invoeren!$G$32=1,1,\nIF(Invoeren!$G$32=\"2 tot 200\",2,\nIF(Invoeren!$G$32=\"200 tot 500\",3,\nIF(Invoeren!$G$32=\"500 tot 1500\",4,\nIF(Invoeren!$G$32=\"1500 tot 5000\",5,\nIF(Invoeren!$G$32=\"Meer dan 5000\",6,\n\"\"))))))","v":""},{"$f":"IF(Invoeren!$G$34=\"Ja\",1,0)","v":0},{"$f":"IF(Invoeren!$G$35=1,1,\nIF(Invoeren!$G$35=\"2 tot 200\",2,\nIF(Invoeren!$G$35=\"200 tot 500\",3,\nIF(Invoeren!$G$35=\"500 tot 1500\",4,\nIF(Invoeren!$G$35=\"1500 tot 5000\",5,\nIF(Invoeren!$G$35=\"Meer dan 5000\",6,\n\"\"))))))","v":""},0,null,{"$f":"IF(Invoeren!$G$20=\"\",\"\",IF(Invoeren!$G$29=\"\",\"Geen restwarmtebron\",INDEX('B. Lijsten'!$C$44:$G$46, MATCH(Invoeren!$G$20, 'B. Lijsten'!$C$44:$C$46, 0), MATCH($AE32, 'B. Lijsten'!$D$43:$G$43, 0) + 1)))","v":""},{"$f":"IF(Invoeren!$G$27=\"\",\"\",INDEX('B. Lijsten'!$C$17:$F$18, MATCH(Invoeren!$G$27, 'B. Lijsten'!$C$17:$C$18, 0), MATCH('A. Breakdown'!$C32, 'B. Lijsten'!$D$16:$F$16, 0) + 1))","v":""},{"$f":"IF('C. Warmtetechnieken'!O31=\"Nee\",1,0)","v":1},{"$f":"IF(Invoeren!$G$29=\"\",\"\",INDEX('B. Lijsten'!$C$25:$E$26, MATCH(Invoeren!$G$29, 'B. Lijsten'!$C$25:$C$26, 0), MATCH('A. Breakdown'!$AH32, 'B. Lijsten'!$D$24:$E$24, 0) + 1))","v":""},{"$f":"IF('C. Warmtetechnieken'!P31=\"Nee\",1,0)","v":0},{"$f":"IF(W32=0,\"\",IF(Invoeren!$G$28=\"\",\"\",INDEX('B. Lijsten'!$C$21:$E$22,MATCH(Invoeren!$G$28,'B. Lijsten'!$C$21:$C$22,0),MATCH('A. Breakdown'!$AJ32,'B. Lijsten'!$D$20:$E$20,0)+1)))","v":""},0,{"$f":"IF(Invoeren!$G$12=\"\",\"\",INDEX('B. Lijsten'!$C$38:$F$42, MATCH(Invoeren!$G$12, 'B. Lijsten'!$C$38:$C$42, 0), MATCH('A. Breakdown'!$C32, 'B. Lijsten'!$D$37:$F$37, 0) + 1))","v":""},{"$f":"'C. Warmtetechnieken'!G31","v":"ZLT"},{"$f":"IF(Invoeren!$G$8=\"\",\"\",INDEX('B. Lijsten'!$C$28:$G$30,MATCH(Invoeren!$G$8,'B. Lijsten'!$C$28:$C$30,0),MATCH($AN32,'B. Lijsten'!$D$27:$G$27,0)+1))","v":""},{"$f":"IF(Invoeren!$G$9=\"\",\"\",INDEX('B. Lijsten'!$C$32:$G$36,MATCH(Invoeren!$G$9,'B. Lijsten'!$C$32:$C$36,0),MATCH($AN32,'B. Lijsten'!$D$31:$G$31,0)+1))","v":""},null,{"$f":"VLOOKUP(D32,Table1[[Warmtebron & type net]:[Energiearmoede verergerd?]],16,FALSE)","v":"Middelgrote dorpen en/of compacte wijken"},{"$f":"IF(Invoeren!$G$33=\"\",\"\",INDEX('B. Lijsten'!$C$48:$H$51,MATCH(Invoeren!$G$33,'B. Lijsten'!$C$48:$C$51,0),MATCH($AR32,'B. Lijsten'!$D$47:$H$47,0)+1))","v":""}]
[31,{"$f":"'C. Warmtetechnieken'!A32","v":"Thermische energie uit afvalwater - RWZI (TEA)​ LT"},{"$f":"'C. Warmtetechnieken'!B32","v":"Warmtenet"},"Warmtenet - Thermische energie uit afvalwater - RWZI (TEA)​ LT","Een LT-warmtenet op basis van afvalwater aquathermie (TEA) uit de RWZI","Afvalwater aquathermie (TEA)","Een LT-warmtenet op basis van afvalwater aquathermie (TEA) uit de RWZI",null,null,{"$f":"AVERAGE(\nIF(ISNUMBER(AG33) * (AG33<>0), AG33*'B. Lijsten'!$L$9),\nIF(ISNUMBER(AI33) * (AI33<>0), AI33*'B. Lijsten'!$L$11),\nIF(ISNUMBER(AK33) * (AK33<>0), AK33*'B. Lijsten'!$L$10),\nIF(ISNUMBER(AM33) * (AM33<>0), AM33*'B. Lijsten'!$L$5),\nIF(ISNUMBER(AO33) * (AO33<>0), AO33*'B. Lijsten'!$L$3),\nIF(ISNUMBER(AP33) * (AP33<>0), AP33*'B. Lijsten'!$L$4),\nIF(ISNUMBER(AS33) * (AS33<>0), AS33)\n)","v":0},1,0,0,{"$f":"IF(Invoeren!$G$15=\"Ja\",1,0)","v":0},null,null,{"$f":"IF(Invoeren!$G$19=\"Ja\",1,0)","v":0},null,{"$f":"IF(Invoeren!$G$23=\"Ja\",1,0)","v":0},null,null,null,{"$f":"IF(AND(AL33=0,Invoeren!$G$28=\"Ja\"),0,1)","v":1},"",{"$f":"IF('C. Warmtetechnieken'!L32=\"Individueel\",1,\nIF('C. Warmtetechnieken'!L32=\"Klein\",\"2 tot 200\",\nIF('C. Warmtetechnieken'!L32=\"Middel\",\"200 tot 500\",\nIF('C. Warmtetechnieken'!L32=\"Middelgroot\",\"500 tot 1500\",\nIF('C. Warmtetechnieken'!L32=\"Groot\",\"1500 tot 5000\",\nIF('C. Warmtetechnieken'!L32=\"Zeer groot\",\"Meer dan 5000\",\n\"\"))))))","v":"200 tot 500"},3,{"$f":"IF(Invoeren!$G$32=1,1,\nIF(Invoeren!$G$32=\"2 tot 200\",2,\nIF(Invoeren!$G$32=\"200 tot 500\",3,\nIF(Invoeren!$G$32=\"500 tot 1500\",4,\nIF(Invoeren!$G$32=\"1500 tot 5000\",5,\nIF(Invoeren!$G$32=\"Meer dan 5000\",6,\n\"\"))))))","v":""},{"$f":"IF(Invoeren!$G$34=\"Ja\",1,0)","v":0},{"$f":"IF(Invoeren!$G$35=1,1,\nIF(Invoeren!$G$35=\"2 tot 200\",2,\nIF(Invoeren!$G$35=\"200 tot 500\",3,\nIF(Invoeren!$G$35=\"500 tot 1500\",4,\nIF(Invoeren!$G$35=\"1500 tot 5000\",5,\nIF(Invoeren!$G$35=\"Meer dan 5000\",6,\n\"\"))))))","v":""},0,null,{"$f":"IF(Invoeren!$G$20=\"\",\"\",IF(Invoeren!$G$29=\"\",\"Geen restwarmtebron\",INDEX('B. Lijsten'!$C$44:$G$46, MATCH(Invoeren!$G$20, 'B. Lijsten'!$C$44:$C$46, 0), MATCH($AE33, 'B. Lijsten'!$D$43:$G$43, 0) + 1)))","v":""},{"$f":"IF(Invoeren!$G$27=\"\",\"\",INDEX('B. Lijsten'!$C$17:$F$18, MATCH(Invoeren!$G$27, 'B. Lijsten'!$C$17:$C$18, 0), MATCH('A. Breakdown'!$C33, 'B. Lijsten'!$D$16:$F$16, 0) + 1))","v":""},{"$f":"IF('C. Warmtetechnieken'!O32=\"Nee\",1,0)","v":1},{"$f":"IF(Invoeren!$G$29=\"\",\"\",INDEX('B. Lijsten'!$C$25:$E$26, MATCH(Invoeren!$G$29, 'B. Lijsten'!$C$25:$C$26, 0), MATCH('A. Breakdown'!$AH33, 'B. Lijsten'!$D$24:$E$24, 0) + 1))","v":""},{"$f":"IF('C. Warmtetechnieken'!P32=\"Nee\",1,0)","v":0},{"$f":"IF(W33=0,\"\",IF(Invoeren!$G$28=\"\",\"\",INDEX('B. Lijsten'!$C$21:$E$22,MATCH(Invoeren!$G$28,'B. Lijsten'!$C$21:$C$22,0),MATCH('A. Breakdown'!$AJ33,'B. Lijsten'!$D$20:$E$20,0)+1)))","v":""},1,{"$f":"IF(Invoeren!$G$12=\"\",\"\",INDEX('B. Lijsten'!$C$38:$F$42, MATCH(Invoeren!$G$12, 'B. Lijsten'!$C$38:$C$42, 0), MATCH('A. Breakdown'!$C33, 'B. Lijsten'!$D$37:$F$37, 0) + 1))","v":""},{"$f":"'C. Warmtetechnieken'!G32","v":"LT"},{"$f":"IF(Invoeren!$G$8=\"\",\"\",INDEX('B. Lijsten'!$C$28:$G$30,MATCH(Invoeren!$G$8,'B. Lijsten'!$C$28:$C$30,0),MATCH($AN33,'B. Lijsten'!$D$27:$G$27,0)+1))","v":""},{"$f":"IF(Invoeren!$G$9=\"\",\"\",INDEX('B. Lijsten'!$C$32:$G$36,MATCH(Invoeren!$G$9,'B. Lijsten'!$C$32:$C$36,0),MATCH($AN33,'B. Lijsten'!$D$31:$G$31,0)+1))","v":""},null,{"$f":"VLOOKUP(D33,Table1[[Warmtebron & type net]:[Energiearmoede verergerd?]],16,FALSE)","v":"Middelgrote dorpen en/of compacte wijken"},{"$f":"IF(Invoeren!$G$33=\"\",\"\",INDEX('B. Lijsten'!$C$48:$H$51,MATCH(Invoeren!$G$33,'B. Lijsten'!$C$48:$C$51,0),MATCH($AR33,'B. Lijsten'!$D$47:$H$47,0)+1))","v":""}]
[32,{"$f":"'C. Warmtetechnieken'!A33","v":"Thermische energie uit afvalwater - RWZI (TEA)​ LT + WKO"},{"$f":"'C. Warmtetechnieken'!B33","v":"Warmtenet"},"Warmtenet - Thermische energie uit afvalwater - RWZI (TEA)​ LT + WKO","Een LT-warmtenet op basis van afvalwater aquathermie (TEA) uit de RWZI, inclusief WKO","Afvalwater aquathermie (TEA)","Een LT-warmtenet op basis van afvalwater aquathermie (TEA) uit de RWZI, inclusief WKO",null,null,{"$f":"AVERAGE(\nIF(ISNUMBER(AG34) * (AG34<>0), AG34*'B. Lijsten'!$L$9),\nIF(ISNUMBER(AI34) * (AI34<>0), AI34*'B. Lijsten'!$L$11),\nIF(ISNUMBER(AK34) * (AK34<>0), AK34*'B. Lijsten'!$L$10),\nIF(ISNUMBER(AM34) * (AM34<>0), AM34*'B. Lijsten'!$L$5),\nIF(ISNUMBER(AO34) * (AO34<>0), AO34*'B. Lijsten'!$L$3),\nIF(ISNUMBER(AP34) * (AP34<>0), AP34*'B. Lijsten'!$L$4),\nIF(ISNUMBER(AS34) * (AS34<>0), AS34)\n)","v":0},1,0,0,{"$f":"IF(Invoeren!$G$15=\"Ja\",1,0)","v":0},null,null,{"$f":"IF(Invoeren!$G$19=\"Ja\",1,0)","v":0},null,{"$f":"IF(Invoeren!$G$23=\"Ja\",1,0)","v":0},null,null,null,{"$f":"IF(AND(AL34=0,Invoeren!$G$28=\"Ja\"),0,1)","v":1},"",{"$f":"IF('C. Warmtetechnieken'!L33=\"Individueel\",1,\nIF('C. Warmtetechnieken'!L33=\"Klein\",\"2 tot 200\",\nIF('C. Warmtetechnieken'!L33=\"Middel\",\"200 tot 500\",\nIF('C. Warmtetechnieken'!L33=\"Middelgroot\",\"500 tot 1500\",\nIF('C. Warmtetechnieken'!L33=\"Groot\",\"1500 tot 5000\",\nIF('C. Warmtetechnieken'!L33=\"Zeer groot\",\"Meer dan 5000\",\n\"\"))))))","v":"200 tot 500"},3,{"$f":"IF(Invoeren!$G$32=1,1,\nIF(Invoeren!$G$32=\"2 tot 200\",2,\nIF(Invoeren!$G$32=\"200 tot 500\",3,\nIF(Invoeren!$G$32=\"500 tot 1500\",4,\nIF(Invoeren!$G$32=\"1500 tot 5000\",5,\nIF(Invoeren!$G$32=\"Meer dan 5000\",6,\n\"\"))))))","v":""},{"$f":"IF(Invoeren!$G$34=\"Ja\",1,0)","v":0},{"$f":"IF(Invoeren!$G$35=1,1,\nIF(Invoeren!$G$35=\"2 tot 200\",2,\nIF(Invoeren!$G$35=\"200 tot 500\",3,\nIF(Invoeren!$G$35=\"500 tot 1500\",4,\nIF(Invoeren!$G$35=\"1500 tot 5000\",5,\nIF(Invoeren!$G$35=\"Meer dan 5000\",6,\n\"\"))))))","v":""},0,null,{"$f":"IF(Invoeren!$G$20=\"\",\"\",IF(Invoeren!$G$29=\"\",\"Geen restwarmtebron\",INDEX('B. Lijsten'!$C$44:$G$46, MATCH(Invoeren!$G$20, 'B. Lijsten'!$C$44:$C$46, 0), MATCH($AE34, 'B. Lijsten'!$D$43:$G$43, 0) + 1)))","v":""},{"$f":"IF(Invoeren!$G$27=\"\",\"\",INDEX('B. Lijsten'!$C$17:$F$18, MATCH(Invoeren!$G$27, 'B. Lijsten'!$C$17:$C$18, 0), MATCH('A. Breakdown'!$C34, 'B. Lijsten'!$D$16:$F$16, 0) + 1))","v":""},{"$f":"IF('C. Warmtetechnieken'!O33=\"Nee\",1,0)","v":1},{"$f":"IF(Invoeren!$G$29=\"\",\"\",INDEX('B. Lijsten'!$C$25:$E$26, MATCH(Invoeren!$G$29, 'B. Lijsten'!$C$25:$C$26, 0), MATCH('A. Breakdown'!$AH34, 'B. Lijsten'!$D$24:$E$24, 0) + 1))","v":""},{"$f":"IF('C. Warmtetechnieken'!P33=\"Nee\",1,0)","v":0},{"$f":"IF(W34=0,\"\",IF(Invoeren!$G$28=\"\",\"\",INDEX('B. Lijsten'!$C$21:$E$22,MATCH(Invoeren!$G$28,'B. Lijsten'!$C$21:$C$22,0),MATCH('A. Breakdown'!$AJ34,'B. Lijsten'!$D$20:$E$20,0)+1)))","v":""},0,{"$f":"IF(Invoeren!$G$12=\"\",\"\",INDEX('B. Lijsten'!$C$38:$F$42, MATCH(Invoeren!$G$12, 'B. Lijsten'!$C$38:$C$42, 0), MATCH('A. Breakdown'!$C34, 'B. Lijsten'!$D$37:$F$37, 0) + 1))","v":""},{"$f":"'C. Warmtetechnieken'!G33","v":"LT"},{"$f":"IF(Invoeren!$G$8=\"\",\"\",INDEX('B. Lijsten'!$C$28:$G$30,MATCH(Invoeren!$G$8,'B. Lijsten'!$C$28:$C$30,0),MATCH($AN34,'B. Lijsten'!$D$27:$G$27,0)+1))","v":""},{"$f":"IF(Invoeren!$G$9=\"\",\"\",INDEX('B. Lijsten'!$C$32:$G$36,MATCH(Invoeren!$G$9,'B. Lijsten'!$C$32:$C$36,0),MATCH($AN34,'B. Lijsten'!$D$31:$G$31,0)+1))","v":""},null,{"$f":"VLOOKUP(D34,Table1[[Warmtebron & type net]:[Energiearmoede verergerd?]],16,FALSE)","v":"Middelgrote dorpen en/of compacte wijken"},{"$f":"IF(Invoeren!$G$33=\"\",\"\",INDEX('B. Lijsten'!$C$48:$H$51,MATCH(Invoeren!$G$33,'B. Lijsten'!$C$48:$C$51,0),MATCH($AR34,'B. Lijsten'!$D$47:$H$47,0)+1))","v":""}]
[33,{"$f":"'C. Warmtetechnieken'!A34","v":"Thermische energie uit drinkwater (TED)"},{"$f":"'C. Warmtetechnieken'!B34","v":"Bronnet"},{"$f":"C35&\" - \"&B35","v":"Bronnet - Thermische energie uit drinkwater (TED)"},"Een bronnet op basis van drinkwater aquathermie (TED)","Drinkwater aquathermie (TED)","Een bronnet op basis van drinkwater aquathermie (TED)",null,null,{"$f":"AVERAGE(\nIF(ISNUMBER(AG35) * (AG35<>0), AG35*'B. Lijsten'!$L$9),\nIF(ISNUMBER(AI35) * (AI35<>0), AI35*'B. Lijsten'!$L$11),\nIF(ISNUMBER(AK35) * (AK35<>0), AK35*'B. Lijsten'!$L$10),\nIF(ISNUMBER(AM35) * (AM35<>0), AM35*'B. Lijsten'!$L$5),\nIF(ISNUMBER(AO35) * (AO35<>0), AO35*'B. Lijsten'!$L$3),\nIF(ISNUMBER(AP35) * (AP35<>0), AP35*'B. Lijsten'!$L$4),\nIF(ISNUMBER(AS35) * (AS35<>0), AS35)\n)","v":0},1,{"$f":"IF(AND(ISNUMBER(J35),ISNUMBER(K35),M35=1,X35=1), J35*K35, 0)","v":0},{"$f":"IF(AND(OR(SUM(O35:P35)>0,SUM(R35:T35)>0,U35>0,V35>0),W35>0,X35=1), 1, 0)","v":0},{"$f":"IF(Invoeren!$G$15=\"Ja\",1,0)","v":0},null,null,{"$f":"IF(Invoeren!$G$19=\"Ja\",1,0)","v":0},null,null,{"$f":"IF(Invoeren!$G$24=\"Ja\",1,0)","v":0},null,null,{"$f":"IF(AND(AL35=0,Invoeren!$G$28=\"Ja\"),0,1)","v":1},{"$f":"IF(AD35>=Z35,1,\"\")","v":""},{"$f":"IF('C. Warmtetechnieken'!L34=\"Individueel\",1,\nIF('C. Warmtetechnieken'!L34=\"Klein\",\"2 tot 200\",\nIF('C. Warmtetechnieken'!L34=\"Middel\",\"200 tot 500\",\nIF('C. Warmtetechnieken'!L34=\"Middelgroot\",\"500 tot 1500\",\nIF('C. Warmtetechnieken'!L34=\"Groot\",\"1500 tot 5000\",\nIF('C. Warmtetechnieken'!L34=\"Zeer groot\",\"Meer dan 5000\",\n\"\"))))))","v":"200 tot 500"},{"$f":"IF(Y35=1,1,\nIF(Y35=\"2 tot 200\",2,\nIF(Y35=\"200 tot 500\",3,\nIF(Y35=\"500 tot 1500\",4,\nIF(Y35=\"1500 tot 5000\",5,\nIF(Y35=\"Meer dan 5000\",6,\n\"\"))))))","v":3},{"$f":"IF(Invoeren!$G$32=1,1,\nIF(Invoeren!$G$32=\"2 tot 200\",2,\nIF(Invoeren!$G$32=\"200 tot 500\",3,\nIF(Invoeren!$G$32=\"500 tot 1500\",4,\nIF(Invoeren!$G$32=\"1500 tot 5000\",5,\nIF(Invoeren!$G$32=\"Meer dan 5000\",6,\n\"\"))))))","v":""},{"$f":"IF(Invoeren!$G$34=\"Ja\",1,0)","v":0},{"$f":"IF(Invoeren!$G$35=1,1,\nIF(Invoeren!$G$35=\"2 tot 200\",2,\nIF(Invoeren!$G$35=\"200 tot 500\",3,\nIF(Invoeren!$G$35=\"500 tot 1500\",4,\nIF(Invoeren!$G$35=\"1500 tot 5000\",5,\nIF(Invoeren!$G$35=\"Meer dan 5000\",6,\n\"\"))))))","v":""},{"$f":"MAX(AC35,AA35)","v":0},null,{"$f":"IF(Invoeren!$G$20=\"\",\"\",IF(Invoeren!$G$29=\"\",\"Geen restwarmtebron\",INDEX('B. Lijsten'!$C$44:$G$46, MATCH(Invoeren!$G$20, 'B. Lijsten'!$C$44:$C$46, 0), MATCH($AE35, 'B. Lijsten'!$D$43:$G$43, 0) + 1)))","v":""},{"$f":"IF(Invoeren!$G$27=\"\",\"\",INDEX('B. Lijsten'!$C$17:$F$18, MATCH(Invoeren!$G$27, 'B. Lijsten'!$C$17:$C$18, 0), MATCH('A. Breakdown'!$C35, 'B. Lijsten'!$D$16:$F$16, 0) + 1))","v":""},{"$f":"IF('C. Warmtetechnieken'!O34=\"Nee\",1,0)","v":1},{"$f":"IF(Invoeren!$G$29=\"\",\"\",INDEX('B. Lijsten'!$C$25:$E$26, MATCH(Invoeren!$G$29, 'B. Lijsten'!$C$25:$C$26, 0), MATCH('A. Breakdown'!$AH35, 'B. Lijsten'!$D$24:$E$24, 0) + 1))","v":""},{"$f":"IF('C. Warmtetechnieken'!P34=\"Nee\",1,0)","v":0},{"$f":"IF(W35=0,\"\",IF(Invoeren!$G$28=\"\",\"\",INDEX('B. Lijsten'!$C$21:$E$22,MATCH(Invoeren!$G$28,'B. Lijsten'!$C$21:$C$22,0),MATCH('A. Breakdown'!$AJ35,'B. Lijsten'!$D$20:$E$20,0)+1)))","v":""},0,{"$f":"IF(Invoeren!$G$12=\"\",\"\",INDEX('B. Lijsten'!$C$38:$F$42, MATCH(Invoeren!$G$12, 'B. Lijsten'!$C$38:$C$42, 0), MATCH('A. Breakdown'!$C35, 'B. Lijsten'!$D$37:$F$37, 0) + 1))","v":""},{"$f":"'C. Warmtetechnieken'!G34","v":"ZLT"},{"$f":"IF(Invoeren!$G$8=\"\",\"\",INDEX('B. Lijsten'!$C$28:$G$30,MATCH(Invoeren!$G$8,'B. Lijsten'!$C$28:$C$30,0),MATCH($AN35,'B. Lijsten'!$D$27:$G$27,0)+1))","v":""},{"$f":"IF(Invoeren!$G$9=\"\",\"\",INDEX('B. Lijsten'!$C$32:$G$36,MATCH(Invoeren!$G$9,'B. Lijsten'!$C$32:$C$36,0),MATCH($AN35,'B. Lijsten'!$D$31:$G$31,0)+1))","v":""},null,{"$f":"VLOOKUP(D35,Table1[[Warmtebron & type net]:[Energiearmoede verergerd?]],16,FALSE)","v":"Middelgrote dorpen en/of compacte wijken"},{"$f":"IF(Invoeren!$G$33=\"\",\"\",INDEX('B. Lijsten'!$C$48:$H$51,MATCH(Invoeren!$G$33,'B. Lijsten'!$C$48:$C$51,0),MATCH($AR35,'B. Lijsten'!$D$47:$H$47,0)+1))","v":""}]
[34,{"$f":"'C. Warmtetechnieken'!A35","v":"Thermische energie uit drinkwater (TED) + WKO"},{"$f":"'C. Warmtetechnieken'!B35","v":"Bronnet"},"Bronnet - Thermische energie uit drinkwater (TED) + WKO","Een bronnet op basis van drinkwater aquathermie (TED), inclusief WKO","Drinkwater aquathermie (TED)","Een bronnet op basis van drinkwater aquathermie (TED), inclusief WKO",null,null,{"$f":"AVERAGE(\nIF(ISNUMBER(AG36) * (AG36<>0), AG36*'B. Lijsten'!$L$9),\nIF(ISNUMBER(AI36) * (AI36<>0), AI36*'B. Lijsten'!$L$11),\nIF(ISNUMBER(AK36) * (AK36<>0), AK36*'B. Lijsten'!$L$10),\nIF(ISNUMBER(AM36) * (AM36<>0), AM36*'B. Lijsten'!$L$5),\nIF(ISNUMBER(AO36) * (AO36<>0), AO36*'B. Lijsten'!$L$3),\nIF(ISNUMBER(AP36) * (AP36<>0), AP36*'B. Lijsten'!$L$4),\nIF(ISNUMBER(AS36) * (AS36<>0), AS36)\n)","v":0},1,0,0,{"$f":"IF(Invoeren!$G$15=\"Ja\",1,0)","v":0},null,null,{"$f":"IF(Invoeren!$G$19=\"Ja\",1,0)","v":0},null,null,{"$f":"IF(Invoeren!$G$24=\"Ja\",1,0)","v":0},null,null,{"$f":"IF(AND(AL36=0,Invoeren!$G$28=\"Ja\"),0,1)","v":1},"",{"$f":"IF('C. Warmtetechnieken'!L35=\"Individueel\",1,\nIF('C. Warmtetechnieken'!L35=\"Klein\",\"2 tot 200\",\nIF('C. Warmtetechnieken'!L35=\"Middel\",\"200 tot 500\",\nIF('C. Warmtetechnieken'!L35=\"Middelgroot\",\"500 tot 1500\",\nIF('C. Warmtetechnieken'!L35=\"Groot\",\"1500 tot 5000\",\nIF('C. Warmtetechnieken'!L35=\"Zeer groot\",\"Meer dan 5000\",\n\"\"))))))","v":"200 tot 500"},3,{"$f":"IF(Invoeren!$G$32=1,1,\nIF(Invoeren!$G$32=\"2 tot 200\",2,\nIF(Invoeren!$G$32=\"200 tot 500\",3,\nIF(Invoeren!$G$32=\"500 tot 1500\",4,\nIF(Invoeren!$G$32=\"1500 tot 5000\",5,\nIF(Invoeren!$G$32=\"Meer dan 5000\",6,\n\"\"))))))","v":""},{"$f":"IF(Invoeren!$G$34=\"Ja\",1,0)","v":0},{"$f":"IF(Invoeren!$G$35=1,1,\nIF(Invoeren!$G$35=\"2 tot 200\",2,\nIF(Invoeren!$G$35=\"200 tot 500\",3,\nIF(Invoeren!$G$35=\"500 tot 1500\",4,\nIF(Invoeren!$G$35=\"1500 tot 5000\",5,\nIF(Invoeren!$G$35=\"Meer dan 5000\",6,\n\"\"))))))","v":""},0,null,{"$f":"IF(Invoeren!$G$20=\"\",\"\",IF(Invoeren!$G$29=\"\",\"Geen restwarmtebron\",INDEX('B. Lijsten'!$C$44:$G$46, MATCH(Invoeren!$G$20, 'B. Lijsten'!$C$44:$C$46, 0), MATCH($AE36, 'B. Lijsten'!$D$43:$G$43, 0) + 1)))","v":""},{"$f":"IF(Invoeren!$G$27=\"\",\"\",INDEX('B. Lijsten'!$C$17:$F$18, MATCH(Invoeren!$G$27, 'B. Lijsten'!$C$17:$C$18, 0), MATCH('A. Breakdown'!$C36, 'B. Lijsten'!$D$16:$F$16, 0) + 1))","v":""},{"$f":"IF('C. Warmtetechnieken'!O35=\"Nee\",1,0)","v":1},{"$f":"IF(Invoeren!$G$29=\"\",\"\",INDEX('B. Lijsten'!$C$25:$E$26, MATCH(Invoeren!$G$29, 'B. Lijsten'!$C$25:$C$26, 0), MATCH('A. Breakdown'!$AH36, 'B. Lijsten'!$D$24:$E$24, 0) + 1))","v":""},{"$f":"IF('C. Warmtetechnieken'!P35=\"Nee\",1,0)","v":0},{"$f":"IF(W36=0,\"\",IF(Invoeren!$G$28=\"\",\"\",INDEX('B. Lijsten'!$C$21:$E$22,MATCH(Invoeren!$G$28,'B. Lijsten'!$C$21:$C$22,0),MATCH('A. Breakdown'!$AJ36,'B. Lijsten'!$D$20:$E$20,0)+1)))","v":""},0,{"$f":"IF(Invoeren!$G$12=\"\",\"\",INDEX('B. Lijsten'!$C$38:$F$42, MATCH(Invoeren!$G$12, 'B. Lijsten'!$C$38:$C$42, 0), MATCH('A. Breakdown'!$C36, 'B. Lijsten'!$D$37:$F$37, 0) + 1))","v":""},{"$f":"'C. Warmtetechnieken'!G35","v":"ZLT"},{"$f":"IF(Invoeren!$G$8=\"\",\"\",INDEX('B. Lijsten'!$C$28:$G$30,MATCH(Invoeren!$G$8,'B. Lijsten'!$C$28:$C$30,0),MATCH($AN36,'B. Lijsten'!$D$27:$G$27,0)+1))","v":""},{"$f":"IF(Invoeren!$G$9=\"\",\"\",INDEX('B. Lijsten'!$C$32:$G$36,MATCH(Invoeren!$G$9,'B. Lijsten'!$C$32:$C$36,0),MATCH($AN36,'B. Lijsten'!$D$31:$G$31,0)+1))","v":""},null,{"$f":"VLOOKUP(D36,Table1[[Warmtebron & type net]:[Energiearmoede verergerd?]],16,FALSE)","v":"Middelgrote dorpen en/of compacte wijken"},{"$f":"IF(Invoeren!$G$33=\"\",\"\",INDEX('B. Lijsten'!$C$48:$H$51,MATCH(Invoeren!$G$33,'B. Lijsten'!$C$48:$C$51,0),MATCH($AR36,'B. Lijsten'!$D$47:$H$47,0)+1))","v":""}]
[35,{"$f":"'C. Warmtetechnieken'!A36","v":"Thermische energie uit drinkwater (TED)​ LT"},{"$f":"'C. Warmtetechnieken'!B36","v":"Warmtenet"},"Warmtenet - Thermische energie uit drinkwater (TED)​ LT","Een LT-warmtenet op basis van drinkwater aquathermie (TED)","Drinkwater aquathermie (TED)","Een LT-warmtenet op basis van drinkwater aquathermie (TED)",null,null,{"$f":"AVERAGE(\nIF(ISNUMBER(AG37) * (AG37<>0), AG37*'B. Lijsten'!$L$9),\nIF(ISNUMBER(AI37) * (AI37<>0), AI37*'B. Lijsten'!$L$11),\nIF(ISNUMBER(AK37) * (AK37<>0), AK37*'B. Lijsten'!$L$10),\nIF(ISNUMBER(AM37) * (AM37<>0), AM37*'B. Lijsten'!$L$5),\nIF(ISNUMBER(AO37) * (AO37<>0), AO37*'B. Lijsten'!$L$3),\nIF(ISNUMBER(AP37) * (AP37<>0), AP37*'B. Lijsten'!$L$4),\nIF(ISNUMBER(AS37) * (AS37<>0), AS37)\n)","v":0},1,0,0,{"$f":"IF(Invoeren!$G$15=\"Ja\",1,0)","v":0},null,null,{"$f":"IF(Invoeren!$G$19=\"Ja\",1,0)","v":0},null,null,{"$f":"IF(Invoeren!$G$24=\"Ja\",1,0)","v":0},null,null,{"$f":"IF(AND(AL37=0,Invoeren!$G$28=\"Ja\"),0,1)","v":1},"",{"$f":"IF('C. Warmtetechnieken'!L36=\"Individueel\",1,\nIF('C. Warmtetechnieken'!L36=\"Klein\",\"2 tot 200\",\nIF('C. Warmtetechnieken'!L36=\"Middel\",\"200 tot 500\",\nIF('C. Warmtetechnieken'!L36=\"Middelgroot\",\"500 tot 1500\",\nIF('C. Warmtetechnieken'!L36=\"Groot\",\"1500 tot 5000\",\nIF('C. Warmtetechnieken'!L36=\"Zeer groot\",\"Meer dan 5000\",\n\"\"))))))","v":"200 tot 500"},3,{"$f":"IF(Invoeren!$G$32=1,1,\nIF(Invoeren!$G$32=\"2 tot 200\",2,\nIF(Invoeren!$G$32=\"200 tot 500\",3,\nIF(Invoeren!$G$32=\"500 tot 1500\",4,\nIF(Invoeren!$G$32=\"1500 tot 5000\",5,\nIF(Invoeren!$G$32=\"Meer dan 5000\",6,\n\"\"))))))","v":""},{"$f":"IF(Invoeren!$G$34=\"Ja\",1,0)","v":0},{"$f":"IF(Invoeren!$G$35=1,1,\nIF(Invoeren!$G$35=\"2 tot 200\",2,\nIF(Invoeren!$G$35=\"200 tot 500\",3,\nIF(Invoeren!$G$35=\"500 tot 1500\",4,\nIF(Invoeren!$G$35=\"1500 tot 5000\",5,\nIF(Invoeren!$G$35=\"Meer dan 5000\",6,\n\"\"))))))","v":""},0,null,{"$f":"IF(Invoeren!$G$20=\"\",\"\",IF(Invoeren!$G$29=\"\",\"Geen restwarmtebron\",INDEX('B. Lijsten'!$C$44:$G$46, MATCH(Invoeren!$G$20, 'B. Lijsten'!$C$44:$C$46, 0), MATCH($AE37, 'B. Lijsten'!$D$43:$G$43, 0) + 1)))","v":""},{"$f":"IF(Invoeren!$G$27=\"\",\"\",INDEX('B. Lijsten'!$C$17:$F$18, MATCH(Invoeren!$G$27, 'B. Lijsten'!$C$17:$C$18, 0), MATCH('A. Breakdown'!$C37, 'B. Lijsten'!$D$16:$F$16, 0) + 1))","v":""},{"$f":"IF('C. Warmtetechnieken'!O36=\"Nee\",1,0)","v":1},{"$f":"IF(Invoeren!$G$29=\"\",\"\",INDEX('B. Lijsten'!$C$25:$E$26, MATCH(Invoeren!$G$29, 'B. Lijsten'!$C$25:$C$26, 0), MATCH('A. Breakdown'!$AH37, 'B. Lijsten'!$D$24:$E$24, 0) + 1))","v":""},{"$f":"IF('C. Warmtetechnieken'!P36=\"Nee\",1,0)","v":0},{"$f":"IF(W37=0,\"\",IF(Invoeren!$G$28=\"\",\"\",INDEX('B. Lijsten'!$C$21:$E$22,MATCH(Invoeren!$G$28,'B. Lijsten'!$C$21:$C$22,0),MATCH('A. Breakdown'!$AJ37,'B. Lijsten'!$D$20:$E$20,0)+1)))","v":""},0,{"$f":"IF(Invoeren!$G$12=\"\",\"\",INDEX('B. Lijsten'!$C$38:$F$42, MATCH(Invoeren!$G$12, 'B. Lijsten'!$C$38:$C$42, 0), MATCH('A. Breakdown'!$C37, 'B. Lijsten'!$D$37:$F$37, 0) + 1))","v":""},{"$f":"'C. Warmtetechnieken'!G36","v":"LT"},{"$f":"IF(Invoeren!$G$8=\"\",\"\",INDEX('B. Lijsten'!$C$28:$G$30,MATCH(Invoeren!$G$8,'B. Lijsten'!$C$28:$C$30,0),MATCH($AN37,'B. Lijsten'!$D$27:$G$27,0)+1))","v":""},{"$f":"IF(Invoeren!$G$9=\"\",\"\",INDEX('B. Lijsten'!$C$32:$G$36,MATCH(Invoeren!$G$9,'B. Lijsten'!$C$32:$C$36,0),MATCH($AN37,'B. Lijsten'!$D$31:$G$31,0)+1))","v":""},null,{"$f":"VLOOKUP(D37,Table1[[Warmtebron & type net]:[Energiearmoede verergerd?]],16,FALSE)","v":"Middelgrote dorpen en/of compacte wijken"},{"$f":"IF(Invoeren!$G$33=\"\",\"\",INDEX('B. Lijsten'!$C$48:$H$51,MATCH(Invoeren!$G$33,'B. Lijsten'!$C$48:$C$51,0),MATCH($AR37,'B. Lijsten'!$D$47:$H$47,0)+1))","v":""}]
[36,{"$f":"'C. Warmtetechnieken'!A37","v":"Thermische energie uit drinkwater (TED)​ LT + WKO"},{"$f":"'C. Warmtetechnieken'!B37","v":"Warmtenet"},"Warmtenet - Thermische energie uit drinkwater (TED)​ LT + WKO","Een LT-warmtenet op basis van drinkwater aquathermie (TED), inclusief WKO","Drinkwater aquathermie (TED)","Een LT-warmtenet op basis van drinkwater aquathermie (TED), inclusief WKO",null,null,{"$f":"AVERAGE(\nIF(ISNUMBER(AG38) * (AG38<>0), AG38*'B. Lijsten'!$L$9),\nIF(ISNUMBER(AI38) * (AI38<>0), AI38*'B. Lijsten'!$L$11),\nIF(ISNUMBER(AK38) * (AK38<>0), AK38*'B. Lijsten'!$L$10),\nIF(ISNUMBER(AM38) * (AM38<>0), AM38*'B. Lijsten'!$L$5),\nIF(ISNUMBER(AO38) * (AO38<>0), AO38*'B. Lijsten'!$L$3),\nIF(ISNUMBER(AP38) * (AP38<>0), AP38*'B. Lijsten'!$L$4),\nIF(ISNUMBER(AS38) * (AS38<>0), AS38)\n)","v":0},1,0,0,{"$f":"IF(Invoeren!$G$15=\"Ja\",1,0)","v":0},null,null,{"$f":"IF(Invoeren!$G$19=\"Ja\",1,0)","v":0},null,null,{"$f":"IF(Invoeren!$G$24=\"Ja\",1,0)","v":0},null,null,{"$f":"IF(AND(AL38=0,Invoeren!$G$28=\"Ja\"),0,1)","v":1},"",{"$f":"IF('C. Warmtetechnieken'!L37=\"Individueel\",1,\nIF('C. Warmtetechnieken'!L37=\"Klein\",\"2 tot 200\",\nIF('C. Warmtetechnieken'!L37=\"Middel\",\"200 tot 500\",\nIF('C. Warmtetechnieken'!L37=\"Middelgroot\",\"500 tot 1500\",\nIF('C. Warmtetechnieken'!L37=\"Groot\",\"1500 tot 5000\",\nIF('C. Warmtetechnieken'!L37=\"Zeer groot\",\"Meer dan 5000\",\n\"\"))))))","v":"200 tot 500"},3,{"$f":"IF(Invoeren!$G$32=1,1,\nIF(Invoeren!$G$32=\"2 tot 200\",2,\nIF(Invoeren!$G$32=\"200 tot 500\",3,\nIF(Invoeren!$G$32=\"500 tot 1500\",4,\nIF(Invoeren!$G$32=\"1500 tot 5000\",5,\nIF(Invoeren!$G$32=\"Meer dan 5000\",6,\n\"\"))))))","v":""},{"$f":"IF(Invoeren!$G$34=\"Ja\",1,0)","v":0},{"$f":"IF(Invoeren!$G$35=1,1,\nIF(Invoeren!$G$35=\"2 tot 200\",2,\nIF(Invoeren!$G$35=\"200 tot 500\",3,\nIF(Invoeren!$G$35=\"500 tot 1500\",4,\nIF(Invoeren!$G$35=\"1500 tot 5000\",5,\nIF(Invoeren!$G$35=\"Meer dan 5000\",6,\n\"\"))))))","v":""},0,null,{"$f":"IF(Invoeren!$G$20=\"\",\"\",IF(Invoeren!$G$29=\"\",\"Geen restwarmtebron\",INDEX('B. Lijsten'!$C$44:$G$46, MATCH(Invoeren!$G$20, 'B. Lijsten'!$C$44:$C$46, 0), MATCH($AE38, 'B. Lijsten'!$D$43:$G$43, 0) + 1)))","v":""},{"$f":"IF(Invoeren!$G$27=\"\",\"\",INDEX('B. Lijsten'!$C$17:$F$18, MATCH(Invoeren!$G$27, 'B. Lijsten'!$C$17:$C$18, 0), MATCH('A. Breakdown'!$C38, 'B. Lijsten'!$D$16:$F$16, 0) + 1))","v":""},{"$f":"IF('C. Warmtetechnieken'!O37=\"Nee\",1,0)","v":1},{"$f":"IF(Invoeren!$G$29=\"\",\"\",INDEX('B. Lijsten'!$C$25:$E$26, MATCH(Invoeren!$G$29, 'B. Lijsten'!$C$25:$C$26, 0), MATCH('A. Breakdown'!$AH38, 'B. Lijsten'!$D$24:$E$24, 0) + 1))","v":""},{"$f":"IF('C. Warmtetechnieken'!P37=\"Nee\",1,0)","v":0},{"$f":"IF(W38=0,\"\",IF(Invoeren!$G$28=\"\",\"\",INDEX('B. Lijsten'!$C$21:$E$22,MATCH(Invoeren!$G$28,'B. Lijsten'!$C$21:$C$22,0),MATCH('A. Breakdown'!$AJ38,'B. Lijsten'!$D$20:$E$20,0)+1)))","v":""},0,{"$f":"IF(Invoeren!$G$12=\"\",\"\",INDEX('B. Lijsten'!$C$38:$F$42, MATCH(Invoeren!$G$12, 'B. Lijsten'!$C$38:$C$42, 0), MATCH('A. Breakdown'!$C38, 'B. Lijsten'!$D$37:$F$37, 0) + 1))","v":""},{"$f":"'C. Warmtetechnieken'!G37","v":"LT"},{"$f":"IF(Invoeren!$G$8=\"\",\"\",INDEX('B. Lijsten'!$C$28:$G$30,MATCH(Invoeren!$G$8,'B. Lijsten'!$C$28:$C$30,0),MATCH($AN38,'B. Lijsten'!$D$27:$G$27,0)+1))","v":""},{"$f":"IF(Invoeren!$G$9=\"\",\"\",INDEX('B. Lijsten'!$C$32:$G$36,MATCH(Invoeren!$G$9,'B. Lijsten'!$C$32:$C$36,0),MATCH($AN38,'B. Lijsten'!$D$31:$G$31,0)+1))","v":""},null,{"$f":"VLOOKUP(D38,Table1[[Warmtebron & type net]:[Energiearmoede verergerd?]],16,FALSE)","v":"Middelgrote dorpen en/of compacte wijken"},{"$f":"IF(Invoeren!$G$33=\"\",\"\",INDEX('B. Lijsten'!$C$48:$H$51,MATCH(Invoeren!$G$33,'B. Lijsten'!$C$48:$C$51,0),MATCH($AR38,'B. Lijsten'!$D$47:$H$47,0)+1))","v":""}]
[37,{"$f":"'C. Warmtetechnieken'!A38","v":"Thermische energie uit oppervlaktewater (TEO)"},{"$f":"'C. Warmtetechnieken'!B38","v":"Bronnet"},"Bronnet - Thermische energie uit oppervlaktewater (TEO)","Een bronnet op basis van oppervlaktewater aquathermie (TEO)","Oppervlaktewater aquathermie (TEO)","Een bronnet op basis van oppervlaktewater aquathermie (TEO)",null,null,{"$f":"AVERAGE(\nIF(ISNUMBER(AG39) * (AG39<>0), AG39*'B. Lijsten'!$L$9),\nIF(ISNUMBER(AI39) * (AI39<>0), AI39*'B. Lijsten'!$L$11),\nIF(ISNUMBER(AK39) * (AK39<>0), AK39*'B. Lijsten'!$L$10),\nIF(ISNUMBER(AM39) * (AM39<>0), AM39*'B. Lijsten'!$L$5),\nIF(ISNUMBER(AO39) * (AO39<>0), AO39*'B. Lijsten'!$L$3),\nIF(ISNUMBER(AP39) * (AP39<>0), AP39*'B. Lijsten'!$L$4),\nIF(ISNUMBER(AS39) * (AS39<>0), AS39)\n)","v":0},1,0,0,{"$f":"IF(Invoeren!$G$15=\"Ja\",1,0)","v":0},null,null,{"$f":"IF(Invoeren!$G$19=\"Ja\",1,0)","v":0},{"$f":"IF(Invoeren!$G$22=\"Ja\",1,0)","v":0},null,null,null,null,{"$f":"IF(AND(AL39=0,Invoeren!$G$28=\"Ja\"),0,1)","v":1},"",{"$f":"IF('C. Warmtetechnieken'!L38=\"Individueel\",1,\nIF('C. Warmtetechnieken'!L38=\"Klein\",\"2 tot 200\",\nIF('C. Warmtetechnieken'!L38=\"Middel\",\"200 tot 500\",\nIF('C. Warmtetechnieken'!L38=\"Middelgroot\",\"500 tot 1500\",\nIF('C. Warmtetechnieken'!L38=\"Groot\",\"1500 tot 5000\",\nIF('C. Warmtetechnieken'!L38=\"Zeer groot\",\"Meer dan 5000\",\n\"\"))))))","v":"200 tot 500"},3,{"$f":"IF(Invoeren!$G$32=1,1,\nIF(Invoeren!$G$32=\"2 tot 200\",2,\nIF(Invoeren!$G$32=\"200 tot 500\",3,\nIF(Invoeren!$G$32=\"500 tot 1500\",4,\nIF(Invoeren!$G$32=\"1500 tot 5000\",5,\nIF(Invoeren!$G$32=\"Meer dan 5000\",6,\n\"\"))))))","v":""},{"$f":"IF(Invoeren!$G$34=\"Ja\",1,0)","v":0},{"$f":"IF(Invoeren!$G$35=1,1,\nIF(Invoeren!$G$35=\"2 tot 200\",2,\nIF(Invoeren!$G$35=\"200 tot 500\",3,\nIF(Invoeren!$G$35=\"500 tot 1500\",4,\nIF(Invoeren!$G$35=\"1500 tot 5000\",5,\nIF(Invoeren!$G$35=\"Meer dan 5000\",6,\n\"\"))))))","v":""},0,null,{"$f":"IF(Invoeren!$G$20=\"\",\"\",IF(Invoeren!$G$29=\"\",\"Geen restwarmtebron\",INDEX('B. Lijsten'!$C$44:$G$46, MATCH(Invoeren!$G$20, 'B. Lijsten'!$C$44:$C$46, 0), MATCH($AE39, 'B. Lijsten'!$D$43:$G$43, 0) + 1)))","v":""},{"$f":"IF(Invoeren!$G$27=\"\",\"\",INDEX('B. Lijsten'!$C$17:$F$18, MATCH(Invoeren!$G$27, 'B. Lijsten'!$C$17:$C$18, 0), MATCH('A. Breakdown'!$C39, 'B. Lijsten'!$D$16:$F$16, 0) + 1))","v":""},{"$f":"IF('C. Warmtetechnieken'!O38=\"Nee\",1,0)","v":1},{"$f":"IF(Invoeren!$G$29=\"\",\"\",INDEX('B. Lijsten'!$C$25:$E$26, MATCH(Invoeren!$G$29, 'B. Lijsten'!$C$25:$C$26, 0), MATCH('A. Breakdown'!$AH39, 'B. Lijsten'!$D$24:$E$24, 0) + 1))","v":""},{"$f":"IF('C. Warmtetechnieken'!P38=\"Nee\",1,0)","v":0},{"$f":"IF(W39=0,\"\",IF(Invoeren!$G$28=\"\",\"\",INDEX('B. Lijsten'!$C$21:$E$22,MATCH(Invoeren!$G$28,'B. Lijsten'!$C$21:$C$22,0),MATCH('A. Breakdown'!$AJ39,'B. Lijsten'!$D$20:$E$20,0)+1)))","v":""},0,{"$f":"IF(Invoeren!$G$12=\"\",\"\",INDEX('B. Lijsten'!$C$38:$F$42, MATCH(Invoeren!$G$12, 'B. Lijsten'!$C$38:$C$42, 0), MATCH('A. Breakdown'!$C39, 'B. Lijsten'!$D$37:$F$37, 0) + 1))","v":""},{"$f":"'C. Warmtetechnieken'!G38","v":"ZLT"},{"$f":"IF(Invoeren!$G$8=\"\",\"\",INDEX('B. Lijsten'!$C$28:$G$30,MATCH(Invoeren!$G$8,'B. Lijsten'!$C$28:$C$30,0),MATCH($AN39,'B. Lijsten'!$D$27:$G$27,0)+1))","v":""},{"$f":"IF(Invoeren!$G$9=\"\",\"\",INDEX('B. Lijsten'!$C$32:$G$36,MATCH(Invoeren!$G$9,'B. Lijsten'!$C$32:$C$36,0),MATCH($AN39,'B. Lijsten'!$D$31:$G$31,0)+1))","v":""},null,{"$f":"VLOOKUP(D39,Table1[[Warmtebron & type net]:[Energiearmoede verergerd?]],16,FALSE)","v":"Middelgrote dorpen en/of compacte wijken"},{"$f":"IF(Invoeren!$G$33=\"\",\"\",INDEX('B. Lijsten'!$C$48:$H$51,MATCH(Invoeren!$G$33,'B. Lijsten'!$C$48:$C$51,0),MATCH($AR39,'B. Lijsten'!$D$47:$H$47,0)+1))","v":""}]
[38,{"$f":"'C. Warmtetechnieken'!A39","v":"Thermische energie uit oppervlaktewater (TEO)​ + WKO"},{"$f":"'C. Warmtetechnieken'!B39","v":"Bronnet"},"Bronnet - Thermische energie uit oppervlaktewater (TEO)​ + WKO","Een bronnet op basis van oppervlaktewater aquathermie (TEO), inclusief WKO","Oppervlaktewater aquathermie (TEO)","Een bronnet op basis van oppervlaktewater aquathermie (TEO), inclusief WKO",null,null,{"$f":"AVERAGE(\nIF(ISNUMBER(AG40) * (AG40<>0), AG40*'B. Lijsten'!$L$9),\nIF(ISNUMBER(AI40) * (AI40<>0), AI40*'B. Lijsten'!$L$11),\nIF(ISNUMBER(AK40) * (AK40<>0), AK40*'B. Lijsten'!$L$10),\nIF(ISNUMBER(AM40) * (AM40<>0), AM40*'B. Lijsten'!$L$5),\nIF(ISNUMBER(AO40) * (AO40<>0), AO40*'B. Lijsten'!$L$3),\nIF(ISNUMBER(AP40) * (AP40<>0), AP40*'B. Lijsten'!$L$4),\nIF(ISNUMBER(AS40) * (AS40<>0), AS40)\n)","v":0},1,0,0,{"$f":"IF(Invoeren!$G$15=\"Ja\",1,0)","v":0},null,null,{"$f":"IF(Invoeren!$G$19=\"Ja\",1,0)","v":0},{"$f":"IF(Invoeren!$G$22=\"Ja\",1,0)","v":0},null,null,null,null,{"$f":"IF(AND(AL40=0,Invoeren!$G$28=\"Ja\"),0,1)","v":1},"",{"$f":"IF('C. Warmtetechnieken'!L39=\"Individueel\",1,\nIF('C. Warmtetechnieken'!L39=\"Klein\",\"2 tot 200\",\nIF('C. Warmtetechnieken'!L39=\"Middel\",\"200 tot 500\",\nIF('C. Warmtetechnieken'!L39=\"Middelgroot\",\"500 tot 1500\",\nIF('C. Warmtetechnieken'!L39=\"Groot\",\"1500 tot 5000\",\nIF('C. Warmtetechnieken'!L39=\"Zeer groot\",\"Meer dan 5000\",\n\"\"))))))","v":"200 tot 500"},3,{"$f":"IF(Invoeren!$G$32=1,1,\nIF(Invoeren!$G$32=\"2 tot 200\",2,\nIF(Invoeren!$G$32=\"200 tot 500\",3,\nIF(Invoeren!$G$32=\"500 tot 1500\",4,\nIF(Invoeren!$G$32=\"1500 tot 5000\",5,\nIF(Invoeren!$G$32=\"Meer dan 5000\",6,\n\"\"))))))","v":""},{"$f":"IF(Invoeren!$G$34=\"Ja\",1,0)","v":0},{"$f":"IF(Invoeren!$G$35=1,1,\nIF(Invoeren!$G$35=\"2 tot 200\",2,\nIF(Invoeren!$G$35=\"200 tot 500\",3,\nIF(Invoeren!$G$35=\"500 tot 1500\",4,\nIF(Invoeren!$G$35=\"1500 tot 5000\",5,\nIF(Invoeren!$G$35=\"Meer dan 5000\",6,\n\"\"))))))","v":""},0,null,{"$f":"IF(Invoeren!$G$20=\"\",\"\",IF(Invoeren!$G$29=\"\",\"Geen restwarmtebron\",INDEX('B. Lijsten'!$C$44:$G$46, MATCH(Invoeren!$G$20, 'B. Lijsten'!$C$44:$C$46, 0), MATCH($AE40, 'B. Lijsten'!$D$43:$G$43, 0) + 1)))","v":""},{"$f":"IF(Invoeren!$G$27=\"\",\"\",INDEX('B. Lijsten'!$C$17:$F$18, MATCH(Invoeren!$G$27, 'B. Lijsten'!$C$17:$C$18, 0), MATCH('A. Breakdown'!$C40, 'B. Lijsten'!$D$16:$F$16, 0) + 1))","v":""},{"$f":"IF('C. Warmtetechnieken'!O39=\"Nee\",1,0)","v":1},{"$f":"IF(Invoeren!$G$29=\"\",\"\",INDEX('B. Lijsten'!$C$25:$E$26, MATCH(Invoeren!$G$29, 'B. Lijsten'!$C$25:$C$26, 0), MATCH('A. Breakdown'!$AH40, 'B. Lijsten'!$D$24:$E$24, 0) + 1))","v":""},{"$f":"IF('C. Warmtetechnieken'!P39=\"Nee\",1,0)","v":0},{"$f":"IF(W40=0,\"\",IF(Invoeren!$G$28=\"\",\"\",INDEX('B. Lijsten'!$C$21:$E$22,MATCH(Invoeren!$G$28,'B. Lijsten'!$C$21:$C$22,0),MATCH('A. Breakdown'!$AJ40,'B. Lijsten'!$D$20:$E$20,0)+1)))","v":""},0,{"$f":"IF(Invoeren!$G$12=\"\",\"\",INDEX('B. Lijsten'!$C$38:$F$42, MATCH(Invoeren!$G$12, 'B. Lijsten'!$C$38:$C$42, 0), MATCH('A. Breakdown'!$C40, 'B. Lijsten'!$D$37:$F$37, 0) + 1))","v":""},{"$f":"'C. Warmtetechnieken'!G39","v":"ZLT"},{"$f":"IF(Invoeren!$G$8=\"\",\"\",INDEX('B. Lijsten'!$C$28:$G$30,MATCH(Invoeren!$G$8,'B. Lijsten'!$C$28:$C$30,0),MATCH($AN40,'B. Lijsten'!$D$27:$G$27,0)+1))","v":""},{"$f":"IF(Invoeren!$G$9=\"\",\"\",INDEX('B. Lijsten'!$C$32:$G$36,MATCH(Invoeren!$G$9,'B. Lijsten'!$C$32:$C$36,0),MATCH($AN40,'B. Lijsten'!$D$31:$G$31,0)+1))","v":""},null,{"$f":"VLOOKUP(D40,Table1[[Warmtebron & type net]:[Energiearmoede verergerd?]],16,FALSE)","v":"Middelgrote dorpen en/of compacte wijken"},{"$f":"IF(Invoeren!$G$33=\"\",\"\",INDEX('B. Lijsten'!$C$48:$H$51,MATCH(Invoeren!$G$33,'B. Lijsten'!$C$48:$C$51,0),MATCH($AR40,'B. Lijsten'!$D$47:$H$47,0)+1))","v":""}]
[39,{"$f":"'C. Warmtetechnieken'!A40","v":"Thermische energie uit oppervlaktewater (TEO)​ LT"},{"$f":"'C. Warmtetechnieken'!B40","v":"Warmtenet"},"Warmtenet - Thermische energie uit oppervlaktewater (TEO)​ LT","Een LT-warmtenet op basis van oppervlaktewater aquathermie (TEO)","Oppervlaktewater aquathermie (TEO)","Een LT-warmtenet op basis van oppervlaktewater aquathermie (TEO)",null,null,{"$f":"AVERAGE(\nIF(ISNUMBER(AG41) * (AG41<>0), AG41*'B. Lijsten'!$L$9),\nIF(ISNUMBER(AI41) * (AI41<>0), AI41*'B. Lijsten'!$L$11),\nIF(ISNUMBER(AK41) * (AK41<>0), AK41*'B. Lijsten'!$L$10),\nIF(ISNUMBER(AM41) * (AM41<>0), AM41*'B. Lijsten'!$L$5),\nIF(ISNUMBER(AO41) * (AO41<>0), AO41*'B. Lijsten'!$L$3),\nIF(ISNUMBER(AP41) * (AP41<>0), AP41*'B. Lijsten'!$L$4),\nIF(ISNUMBER(AS41) * (AS41<>0), AS41)\n)","v":0},1,0,0,{"$f":"IF(Invoeren!$G$15=\"Ja\",1,0)","v":0},null,null,{"$f":"IF(Invoeren!$G$19=\"Ja\",1,0)","v":0},{"$f":"IF(Invoeren!$G$22=\"Ja\",1,0)","v":0},null,null,null,null,{"$f":"IF(AND(AL41=0,Invoeren!$G$28=\"Ja\"),0,1)","v":1},"",{"$f":"IF('C. Warmtetechnieken'!L40=\"Individueel\",1,\nIF('C. Warmtetechnieken'!L40=\"Klein\",\"2 tot 200\",\nIF('C. Warmtetechnieken'!L40=\"Middel\",\"200 tot 500\",\nIF('C. Warmtetechnieken'!L40=\"Middelgroot\",\"500 tot 1500\",\nIF('C. Warmtetechnieken'!L40=\"Groot\",\"1500 tot 5000\",\nIF('C. Warmtetechnieken'!L40=\"Zeer groot\",\"Meer dan 5000\",\n\"\"))))))","v":"200 tot 500"},3,{"$f":"IF(Invoeren!$G$32=1,1,\nIF(Invoeren!$G$32=\"2 tot 200\",2,\nIF(Invoeren!$G$32=\"200 tot 500\",3,\nIF(Invoeren!$G$32=\"500 tot 1500\",4,\nIF(Invoeren!$G$32=\"1500 tot 5000\",5,\nIF(Invoeren!$G$32=\"Meer dan 5000\",6,\n\"\"))))))","v":""},{"$f":"IF(Invoeren!$G$34=\"Ja\",1,0)","v":0},{"$f":"IF(Invoeren!$G$35=1,1,\nIF(Invoeren!$G$35=\"2 tot 200\",2,\nIF(Invoeren!$G$35=\"200 tot 500\",3,\nIF(Invoeren!$G$35=\"500 tot 1500\",4,\nIF(Invoeren!$G$35=\"1500 tot 5000\",5,\nIF(Invoeren!$G$35=\"Meer dan 5000\",6,\n\"\"))))))","v":""},0,null,{"$f":"IF(Invoeren!$G$20=\"\",\"\",IF(Invoeren!$G$29=\"\",\"Geen restwarmtebron\",INDEX('B. Lijsten'!$C$44:$G$46, MATCH(Invoeren!$G$20, 'B. Lijsten'!$C$44:$C$46, 0), MATCH($AE41, 'B. Lijsten'!$D$43:$G$43, 0) + 1)))","v":""},{"$f":"IF(Invoeren!$G$27=\"\",\"\",INDEX('B. Lijsten'!$C$17:$F$18, MATCH(Invoeren!$G$27, 'B. Lijsten'!$C$17:$C$18, 0), MATCH('A. Breakdown'!$C41, 'B. Lijsten'!$D$16:$F$16, 0) + 1))","v":""},{"$f":"IF('C. Warmtetechnieken'!O40=\"Nee\",1,0)","v":1},{"$f":"IF(Invoeren!$G$29=\"\",\"\",INDEX('B. Lijsten'!$C$25:$E$26, MATCH(Invoeren!$G$29, 'B. Lijsten'!$C$25:$C$26, 0), MATCH('A. Breakdown'!$AH41, 'B. Lijsten'!$D$24:$E$24, 0) + 1))","v":""},{"$f":"IF('C. Warmtetechnieken'!P40=\"Nee\",1,0)","v":0},{"$f":"IF(W41=0,\"\",IF(Invoeren!$G$28=\"\",\"\",INDEX('B. Lijsten'!$C$21:$E$22,MATCH(Invoeren!$G$28,'B. Lijsten'!$C$21:$C$22,0),MATCH('A. Breakdown'!$AJ41,'B. Lijsten'!$D$20:$E$20,0)+1)))","v":""},0,{"$f":"IF(Invoeren!$G$12=\"\",\"\",INDEX('B. Lijsten'!$C$38:$F$42, MATCH(Invoeren!$G$12, 'B. Lijsten'!$C$38:$C$42, 0), MATCH('A. Breakdown'!$C41, 'B. Lijsten'!$D$37:$F$37, 0) + 1))","v":""},{"$f":"'C. Warmtetechnieken'!G40","v":"LT"},{"$f":"IF(Invoeren!$G$8=\"\",\"\",INDEX('B. Lijsten'!$C$28:$G$30,MATCH(Invoeren!$G$8,'B. Lijsten'!$C$28:$C$30,0),MATCH($AN41,'B. Lijsten'!$D$27:$G$27,0)+1))","v":""},{"$f":"IF(Invoeren!$G$9=\"\",\"\",INDEX('B. Lijsten'!$C$32:$G$36,MATCH(Invoeren!$G$9,'B. Lijsten'!$C$32:$C$36,0),MATCH($AN41,'B. Lijsten'!$D$31:$G$31,0)+1))","v":""},null,{"$f":"VLOOKUP(D41,Table1[[Warmtebron & type net]:[Energiearmoede verergerd?]],16,FALSE)","v":"Middelgrote dorpen en/of compacte wijken"},{"$f":"IF(Invoeren!$G$33=\"\",\"\",INDEX('B. Lijsten'!$C$48:$H$51,MATCH(Invoeren!$G$33,'B. Lijsten'!$C$48:$C$51,0),MATCH($AR41,'B. Lijsten'!$D$47:$H$47,0)+1))","v":""}]
[40,{"$f":"'C. Warmtetechnieken'!A41","v":"Thermische energie uit oppervlaktewater (TEO)​ LT + WKO"},{"$f":"'C. Warmtetechnieken'!B41","v":"Warmtenet"},"Warmtenet - Thermische energie uit oppervlaktewater (TEO)​ LT + WKO","Een LT-warmtenet op basis van Oppervlaktewater aquathermie (TEO), inclusief WKO","Oppervlaktewater aquathermie (TEO)","Een LT-warmtenet op basis van Oppervlaktewater aquathermie (TEO), inclusief WKO",null,null,{"$f":"AVERAGE(\nIF(ISNUMBER(AG42) * (AG42<>0), AG42*'B. Lijsten'!$L$9),\nIF(ISNUMBER(AI42) * (AI42<>0), AI42*'B. Lijsten'!$L$11),\nIF(ISNUMBER(AK42) * (AK42<>0), AK42*'B. Lijsten'!$L$10),\nIF(ISNUMBER(AM42) * (AM42<>0), AM42*'B. Lijsten'!$L$5),\nIF(ISNUMBER(AO42) * (AO42<>0), AO42*'B. Lijsten'!$L$3),\nIF(ISNUMBER(AP42) * (AP42<>0), AP42*'B. Lijsten'!$L$4),\nIF(ISNUMBER(AS42) * (AS42<>0), AS42)\n)","v":0},1,0,0,{"$f":"IF(Invoeren!$G$15=\"Ja\",1,0)","v":0},null,null,{"$f":"IF(Invoeren!$G$19=\"Ja\",1,0)","v":0},{"$f":"IF(Invoeren!$G$22=\"Ja\",1,0)","v":0},null,null,null,null,{"$f":"IF(AND(AL42=0,Invoeren!$G$28=\"Ja\"),0,1)","v":1},"",{"$f":"IF('C. Warmtetechnieken'!L41=\"Individueel\",1,\nIF('C. Warmtetechnieken'!L41=\"Klein\",\"2 tot 200\",\nIF('C. Warmtetechnieken'!L41=\"Middel\",\"200 tot 500\",\nIF('C. Warmtetechnieken'!L41=\"Middelgroot\",\"500 tot 1500\",\nIF('C. Warmtetechnieken'!L41=\"Groot\",\"1500 tot 5000\",\nIF('C. Warmtetechnieken'!L41=\"Zeer groot\",\"Meer dan 5000\",\n\"\"))))))","v":"200 tot 500"},3,{"$f":"IF(Invoeren!$G$32=1,1,\nIF(Invoeren!$G$32=\"2 tot 200\",2,\nIF(Invoeren!$G$32=\"200 tot 500\",3,\nIF(Invoeren!$G$32=\"500 tot 1500\",4,\nIF(Invoeren!$G$32=\"1500 tot 5000\",5,\nIF(Invoeren!$G$32=\"Meer dan 5000\",6,\n\"\"))))))","v":""},{"$f":"IF(Invoeren!$G$34=\"Ja\",1,0)","v":0},{"$f":"IF(Invoeren!$G$35=1,1,\nIF(Invoeren!$G$35=\"2 tot 200\",2,\nIF(Invoeren!$G$35=\"200 tot 500\",3,\nIF(Invoeren!$G$35=\"500 tot 1500\",4,\nIF(Invoeren!$G$35=\"1500 tot 5000\",5,\nIF(Invoeren!$G$35=\"Meer dan 5000\",6,\n\"\"))))))","v":""},0,null,{"$f":"IF(Invoeren!$G$20=\"\",\"\",IF(Invoeren!$G$29=\"\",\"Geen restwarmtebron\",INDEX('B. Lijsten'!$C$44:$G$46, MATCH(Invoeren!$G$20, 'B. Lijsten'!$C$44:$C$46, 0), MATCH($AE42, 'B. Lijsten'!$D$43:$G$43, 0) + 1)))","v":""},{"$f":"IF(Invoeren!$G$27=\"\",\"\",INDEX('B. Lijsten'!$C$17:$F$18, MATCH(Invoeren!$G$27, 'B. Lijsten'!$C$17:$C$18, 0), MATCH('A. Breakdown'!$C42, 'B. Lijsten'!$D$16:$F$16, 0) + 1))","v":""},{"$f":"IF('C. Warmtetechnieken'!O41=\"Nee\",1,0)","v":1},{"$f":"IF(Invoeren!$G$29=\"\",\"\",INDEX('B. Lijsten'!$C$25:$E$26, MATCH(Invoeren!$G$29, 'B. Lijsten'!$C$25:$C$26, 0), MATCH('A. Breakdown'!$AH42, 'B. Lijsten'!$D$24:$E$24, 0) + 1))","v":""},{"$f":"IF('C. Warmtetechnieken'!P41=\"Nee\",1,0)","v":0},{"$f":"IF(W42=0,\"\",IF(Invoeren!$G$28=\"\",\"\",INDEX('B. Lijsten'!$C$21:$E$22,MATCH(Invoeren!$G$28,'B. Lijsten'!$C$21:$C$22,0),MATCH('A. Breakdown'!$AJ42,'B. Lijsten'!$D$20:$E$20,0)+1)))","v":""},0,{"$f":"IF(Invoeren!$G$12=\"\",\"\",INDEX('B. Lijsten'!$C$38:$F$42, MATCH(Invoeren!$G$12, 'B. Lijsten'!$C$38:$C$42, 0), MATCH('A. Breakdown'!$C42, 'B. Lijsten'!$D$37:$F$37, 0) + 1))","v":""},{"$f":"'C. Warmtetechnieken'!G41","v":"LT"},{"$f":"IF(Invoeren!$G$8=\"\",\"\",INDEX('B. Lijsten'!$C$28:$G$30,MATCH(Invoeren!$G$8,'B. Lijsten'!$C$28:$C$30,0),MATCH($AN42,'B. Lijsten'!$D$27:$G$27,0)+1))","v":""},{"$f":"IF(Invoeren!$G$9=\"\",\"\",INDEX('B. Lijsten'!$C$32:$G$36,MATCH(Invoeren!$G$9,'B. Lijsten'!$C$32:$C$36,0),MATCH($AN42,'B. Lijsten'!$D$31:$G$31,0)+1))","v":""},null,{"$f":"VLOOKUP(D42,Table1[[Warmtebron & type net]:[Energiearmoede verergerd?]],16,FALSE)","v":"Middelgrote dorpen en/of compacte wijken"},{"$f":"IF(Invoeren!$G$33=\"\",\"\",INDEX('B. Lijsten'!$C$48:$H$51,MATCH(Invoeren!$G$33,'B. Lijsten'!$C$48:$C$51,0),MATCH($AR42,'B. Lijsten'!$D$47:$H$47,0)+1))","v":""}]
[41,{"$f":"'C. Warmtetechnieken'!A42","v":"Verbranden van houtige biomassa​"},{"$f":"'C. Warmtetechnieken'!B42","v":"Warmtenet"},"Warmtenet - Verbranden van houtige biomassa​","Een MT-warmtenet op basis van biomassa verbranding","Biomassa ","Een MT-warmtenet op basis van biomassa verbranding",null,null,{"$f":"AVERAGE(\nIF(ISNUMBER(AG43) * (AG43<>0), AG43*'B. Lijsten'!$L$9),\nIF(ISNUMBER(AI43) * (AI43<>0), AI43*'B. Lijsten'!$L$11),\nIF(ISNUMBER(AK43) * (AK43<>0), AK43*'B. Lijsten'!$L$10),\nIF(ISNUMBER(AM43) * (AM43<>0), AM43*'B. Lijsten'!$L$5),\nIF(ISNUMBER(AO43) * (AO43<>0), AO43*'B. Lijsten'!$L$3),\nIF(ISNUMBER(AP43) * (AP43<>0), AP43*'B. Lijsten'!$L$4),\nIF(ISNUMBER(AS43) * (AS43<>0), AS43)\n)","v":0},0.8,0,0,null,null,null,null,null,null,null,null,1,{"$f":"IF(AND(AL43=0,Invoeren!$G$28=\"Ja\"),0,1)","v":1},"",{"$f":"IF('C. Warmtetechnieken'!L42=\"Individueel\",1,\nIF('C. Warmtetechnieken'!L42=\"Klein\",\"2 tot 200\",\nIF('C. Warmtetechnieken'!L42=\"Middel\",\"200 tot 500\",\nIF('C. Warmtetechnieken'!L42=\"Middelgroot\",\"500 tot 1500\",\nIF('C. Warmtetechnieken'!L42=\"Groot\",\"1500 tot 5000\",\nIF('C. Warmtetechnieken'!L42=\"Zeer groot\",\"Meer dan 5000\",\n\"\"))))))","v":"1500 tot 5000"},5,{"$f":"IF(Invoeren!$G$32=1,1,\nIF(Invoeren!$G$32=\"2 tot 200\",2,\nIF(Invoeren!$G$32=\"200 tot 500\",3,\nIF(Invoeren!$G$32=\"500 tot 1500\",4,\nIF(Invoeren!$G$32=\"1500 tot 5000\",5,\nIF(Invoeren!$G$32=\"Meer dan 5000\",6,\n\"\"))))))","v":""},{"$f":"IF(Invoeren!$G$34=\"Ja\",1,0)","v":0},{"$f":"IF(Invoeren!$G$35=1,1,\nIF(Invoeren!$G$35=\"2 tot 200\",2,\nIF(Invoeren!$G$35=\"200 tot 500\",3,\nIF(Invoeren!$G$35=\"500 tot 1500\",4,\nIF(Invoeren!$G$35=\"1500 tot 5000\",5,\nIF(Invoeren!$G$35=\"Meer dan 5000\",6,\n\"\"))))))","v":""},0,null,{"$f":"IF(Invoeren!$G$20=\"\",\"\",IF(Invoeren!$G$29=\"\",\"Geen restwarmtebron\",INDEX('B. Lijsten'!$C$44:$G$46, MATCH(Invoeren!$G$20, 'B. Lijsten'!$C$44:$C$46, 0), MATCH($AE43, 'B. Lijsten'!$D$43:$G$43, 0) + 1)))","v":""},{"$f":"IF(Invoeren!$G$27=\"\",\"\",INDEX('B. Lijsten'!$C$17:$F$18, MATCH(Invoeren!$G$27, 'B. Lijsten'!$C$17:$C$18, 0), MATCH('A. Breakdown'!$C43, 'B. Lijsten'!$D$16:$F$16, 0) + 1))","v":""},{"$f":"IF('C. Warmtetechnieken'!O42=\"Nee\",1,0)","v":0},{"$f":"IF(Invoeren!$G$29=\"\",\"\",INDEX('B. Lijsten'!$C$25:$E$26, MATCH(Invoeren!$G$29, 'B. Lijsten'!$C$25:$C$26, 0), MATCH('A. Breakdown'!$AH43, 'B. Lijsten'!$D$24:$E$24, 0) + 1))","v":""},{"$f":"IF('C. Warmtetechnieken'!P42=\"Nee\",1,0)","v":1},{"$f":"IF(W43=0,\"\",IF(Invoeren!$G$28=\"\",\"\",INDEX('B. Lijsten'!$C$21:$E$22,MATCH(Invoeren!$G$28,'B. Lijsten'!$C$21:$C$22,0),MATCH('A. Breakdown'!$AJ43,'B. Lijsten'!$D$20:$E$20,0)+1)))","v":""},1,{"$f":"IF(Invoeren!$G$12=\"\",\"\",INDEX('B. Lijsten'!$C$38:$F$42, MATCH(Invoeren!$G$12, 'B. Lijsten'!$C$38:$C$42, 0), MATCH('A. Breakdown'!$C43, 'B. Lijsten'!$D$37:$F$37, 0) + 1))","v":""},{"$f":"'C. Warmtetechnieken'!G42","v":"HT"},{"$f":"IF(Invoeren!$G$8=\"\",\"\",INDEX('B. Lijsten'!$C$28:$G$30,MATCH(Invoeren!$G$8,'B. Lijsten'!$C$28:$C$30,0),MATCH($AN43,'B. Lijsten'!$D$27:$G$27,0)+1))","v":""},{"$f":"IF(Invoeren!$G$9=\"\",\"\",INDEX('B. Lijsten'!$C$32:$G$36,MATCH(Invoeren!$G$9,'B. Lijsten'!$C$32:$C$36,0),MATCH($AN43,'B. Lijsten'!$D$31:$G$31,0)+1))","v":""},null,{"$f":"VLOOKUP(D43,Table1[[Warmtebron & type net]:[Energiearmoede verergerd?]],16,FALSE)","v":"Middelgrote dorpen en/of compacte wijken"},{"$f":"IF(Invoeren!$G$33=\"\",\"\",INDEX('B. Lijsten'!$C$48:$H$51,MATCH(Invoeren!$G$33,'B. Lijsten'!$C$48:$C$51,0),MATCH($AR43,'B. Lijsten'!$D$47:$H$47,0)+1))","v":""}]
[42,{"$f":"'C. Warmtetechnieken'!A43","v":"Vergisting/vergassing afval​"},{"$f":"'C. Warmtetechnieken'!B43","v":"Warmtenet"},"Warmtenet - Vergisting/vergassing afval​","Een MT-warmtenet op basis van afval vergisting of vergassing","Afval vergisting of vergassing","Een MT-warmtenet op basis van afval vergisting of vergassing",null,null,{"$f":"AVERAGE(\nIF(ISNUMBER(AG44) * (AG44<>0), AG44*'B. Lijsten'!$L$9),\nIF(ISNUMBER(AI44) * (AI44<>0), AI44*'B. Lijsten'!$L$11),\nIF(ISNUMBER(AK44) * (AK44<>0), AK44*'B. Lijsten'!$L$10),\nIF(ISNUMBER(AM44) * (AM44<>0), AM44*'B. Lijsten'!$L$5),\nIF(ISNUMBER(AO44) * (AO44<>0), AO44*'B. Lijsten'!$L$3),\nIF(ISNUMBER(AP44) * (AP44<>0), AP44*'B. Lijsten'!$L$4),\nIF(ISNUMBER(AS44) * (AS44<>0), AS44)\n)","v":0},0.8,0,0,null,null,null,null,null,null,null,null,1,{"$f":"IF(AND(AL44=0,Invoeren!$G$28=\"Ja\"),0,1)","v":1},"",{"$f":"IF('C. Warmtetechnieken'!L43=\"Individueel\",1,\nIF('C. Warmtetechnieken'!L43=\"Klein\",\"2 tot 200\",\nIF('C. Warmtetechnieken'!L43=\"Middel\",\"200 tot 500\",\nIF('C. Warmtetechnieken'!L43=\"Middelgroot\",\"500 tot 1500\",\nIF('C. Warmtetechnieken'!L43=\"Groot\",\"1500 tot 5000\",\nIF('C. Warmtetechnieken'!L43=\"Zeer groot\",\"Meer dan 5000\",\n\"\"))))))","v":"1500 tot 5000"},5,{"$f":"IF(Invoeren!$G$32=1,1,\nIF(Invoeren!$G$32=\"2 tot 200\",2,\nIF(Invoeren!$G$32=\"200 tot 500\",3,\nIF(Invoeren!$G$32=\"500 tot 1500\",4,\nIF(Invoeren!$G$32=\"1500 tot 5000\",5,\nIF(Invoeren!$G$32=\"Meer dan 5000\",6,\n\"\"))))))","v":""},{"$f":"IF(Invoeren!$G$34=\"Ja\",1,0)","v":0},{"$f":"IF(Invoeren!$G$35=1,1,\nIF(Invoeren!$G$35=\"2 tot 200\",2,\nIF(Invoeren!$G$35=\"200 tot 500\",3,\nIF(Invoeren!$G$35=\"500 tot 1500\",4,\nIF(Invoeren!$G$35=\"1500 tot 5000\",5,\nIF(Invoeren!$G$35=\"Meer dan 5000\",6,\n\"\"))))))","v":""},0,null,{"$f":"IF(Invoeren!$G$20=\"\",\"\",IF(Invoeren!$G$29=\"\",\"Geen restwarmtebron\",INDEX('B. Lijsten'!$C$44:$G$46, MATCH(Invoeren!$G$20, 'B. Lijsten'!$C$44:$C$46, 0), MATCH($AE44, 'B. Lijsten'!$D$43:$G$43, 0) + 1)))","v":""},{"$f":"IF(Invoeren!$G$27=\"\",\"\",INDEX('B. Lijsten'!$C$17:$F$18, MATCH(Invoeren!$G$27, 'B. Lijsten'!$C$17:$C$18, 0), MATCH('A. Breakdown'!$C44, 'B. Lijsten'!$D$16:$F$16, 0) + 1))","v":""},{"$f":"IF('C. Warmtetechnieken'!O43=\"Nee\",1,0)","v":0},{"$f":"IF(Invoeren!$G$29=\"\",\"\",INDEX('B. Lijsten'!$C$25:$E$26, MATCH(Invoeren!$G$29, 'B. Lijsten'!$C$25:$C$26, 0), MATCH('A. Breakdown'!$AH44, 'B. Lijsten'!$D$24:$E$24, 0) + 1))","v":""},{"$f":"IF('C. Warmtetechnieken'!P43=\"Nee\",1,0)","v":1},{"$f":"IF(W44=0,\"\",IF(Invoeren!$G$28=\"\",\"\",INDEX('B. Lijsten'!$C$21:$E$22,MATCH(Invoeren!$G$28,'B. Lijsten'!$C$21:$C$22,0),MATCH('A. Breakdown'!$AJ44,'B. Lijsten'!$D$20:$E$20,0)+1)))","v":""},1,{"$f":"IF(Invoeren!$G$12=\"\",\"\",INDEX('B. Lijsten'!$C$38:$F$42, MATCH(Invoeren!$G$12, 'B. Lijsten'!$C$38:$C$42, 0), MATCH('A. Breakdown'!$C44, 'B. Lijsten'!$D$37:$F$37, 0) + 1))","v":""},{"$f":"'C. Warmtetechnieken'!G43","v":"MT"},{"$f":"IF(Invoeren!$G$8=\"\",\"\",INDEX('B. Lijsten'!$C$28:$G$30,MATCH(Invoeren!$G$8,'B. Lijsten'!$C$28:$C$30,0),MATCH($AN44,'B. Lijsten'!$D$27:$G$27,0)+1))","v":""},{"$f":"IF(Invoeren!$G$9=\"\",\"\",INDEX('B. Lijsten'!$C$32:$G$36,MATCH(Invoeren!$G$9,'B. Lijsten'!$C$32:$C$36,0),MATCH($AN44,'B. Lijsten'!$D$31:$G$31,0)+1))","v":""},null,{"$f":"VLOOKUP(D44,Table1[[Warmtebron & type net]:[Energiearmoede verergerd?]],16,FALSE)","v":"Middelgrote dorpen en/of compacte wijken"},{"$f":"IF(Invoeren!$G$33=\"\",\"\",INDEX('B. Lijsten'!$C$48:$H$51,MATCH(Invoeren!$G$33,'B. Lijsten'!$C$48:$C$51,0),MATCH($AR44,'B. Lijsten'!$D$47:$H$47,0)+1))","v":""}]
[43,{"$f":"'C. Warmtetechnieken'!A44","v":"Warmte uit lokale restwarmte (supermarkten etc.)"},{"$f":"'C. Warmtetechnieken'!B44","v":"Bronnet"},"Bronnet - Warmte uit lokale restwarmte (supermarkten etc.)","Een bronnet op basis van lokale restwarmte","Lokale restwarmte","Een bronnet op basis van lokale restwarmte",null,null,{"$f":"AVERAGE(\nIF(ISNUMBER(AG45) * (AG45<>0), AG45*'B. Lijsten'!$L$9),\nIF(ISNUMBER(AI45) * (AI45<>0), AI45*'B. Lijsten'!$L$11),\nIF(ISNUMBER(AK45) * (AK45<>0), AK45*'B. Lijsten'!$L$10),\nIF(ISNUMBER(AM45) * (AM45<>0), AM45*'B. Lijsten'!$L$5),\nIF(ISNUMBER(AO45) * (AO45<>0), AO45*'B. Lijsten'!$L$3),\nIF(ISNUMBER(AP45) * (AP45<>0), AP45*'B. Lijsten'!$L$4),\nIF(ISNUMBER(AS45) * (AS45<>0), AS45)\n)","v":0},1,0,0,{"$f":"IF(Invoeren!$G$15=\"Ja\",1,0)","v":0},null,null,null,null,null,null,{"$f":"IF(Invoeren!$G$18=\"Ja\",1,0)","v":0},null,{"$f":"IF(AND(AL45=0,Invoeren!$G$28=\"Ja\"),0,1)","v":1},"",{"$f":"IF('C. Warmtetechnieken'!L44=\"Individueel\",1,\nIF('C. Warmtetechnieken'!L44=\"Klein\",\"2 tot 200\",\nIF('C. Warmtetechnieken'!L44=\"Middel\",\"200 tot 500\",\nIF('C. Warmtetechnieken'!L44=\"Middelgroot\",\"500 tot 1500\",\nIF('C. Warmtetechnieken'!L44=\"Groot\",\"1500 tot 5000\",\nIF('C. Warmtetechnieken'!L44=\"Zeer groot\",\"Meer dan 5000\",\n\"\"))))))","v":"2 tot 200"},2,{"$f":"IF(Invoeren!$G$32=1,1,\nIF(Invoeren!$G$32=\"2 tot 200\",2,\nIF(Invoeren!$G$32=\"200 tot 500\",3,\nIF(Invoeren!$G$32=\"500 tot 1500\",4,\nIF(Invoeren!$G$32=\"1500 tot 5000\",5,\nIF(Invoeren!$G$32=\"Meer dan 5000\",6,\n\"\"))))))","v":""},{"$f":"IF(Invoeren!$G$34=\"Ja\",1,0)","v":0},{"$f":"IF(Invoeren!$G$35=1,1,\nIF(Invoeren!$G$35=\"2 tot 200\",2,\nIF(Invoeren!$G$35=\"200 tot 500\",3,\nIF(Invoeren!$G$35=\"500 tot 1500\",4,\nIF(Invoeren!$G$35=\"1500 tot 5000\",5,\nIF(Invoeren!$G$35=\"Meer dan 5000\",6,\n\"\"))))))","v":""},0,"MT",{"$f":"IF(Invoeren!$G$20=\"\",\"\",IF(Invoeren!$G$29=\"\",\"Geen restwarmtebron\",INDEX('B. Lijsten'!$C$44:$G$46, MATCH(Invoeren!$G$20, 'B. Lijsten'!$C$44:$C$46, 0), MATCH($AE45, 'B. Lijsten'!$D$43:$G$43, 0) + 1)))","v":""},{"$f":"IF(Invoeren!$G$27=\"\",\"\",INDEX('B. Lijsten'!$C$17:$F$18, MATCH(Invoeren!$G$27, 'B. Lijsten'!$C$17:$C$18, 0), MATCH('A. Breakdown'!$C45, 'B. Lijsten'!$D$16:$F$16, 0) + 1))","v":""},{"$f":"IF('C. Warmtetechnieken'!O44=\"Nee\",1,0)","v":1},{"$f":"IF(Invoeren!$G$29=\"\",\"\",INDEX('B. Lijsten'!$C$25:$E$26, MATCH(Invoeren!$G$29, 'B. Lijsten'!$C$25:$C$26, 0), MATCH('A. Breakdown'!$AH45, 'B. Lijsten'!$D$24:$E$24, 0) + 1))","v":""},{"$f":"IF('C. Warmtetechnieken'!P44=\"Nee\",1,0)","v":1},{"$f":"IF(W45=0,\"\",IF(Invoeren!$G$28=\"\",\"\",INDEX('B. Lijsten'!$C$21:$E$22,MATCH(Invoeren!$G$28,'B. Lijsten'!$C$21:$C$22,0),MATCH('A. Breakdown'!$AJ45,'B. Lijsten'!$D$20:$E$20,0)+1)))","v":""},1,{"$f":"IF(Invoeren!$G$12=\"\",\"\",INDEX('B. Lijsten'!$C$38:$F$42, MATCH(Invoeren!$G$12, 'B. Lijsten'!$C$38:$C$42, 0), MATCH('A. Breakdown'!$C45, 'B. Lijsten'!$D$37:$F$37, 0) + 1))","v":""},{"$f":"'C. Warmtetechnieken'!G44","v":"LT"},{"$f":"IF(Invoeren!$G$8=\"\",\"\",INDEX('B. Lijsten'!$C$28:$G$30,MATCH(Invoeren!$G$8,'B. Lijsten'!$C$28:$C$30,0),MATCH($AN45,'B. Lijsten'!$D$27:$G$27,0)+1))","v":""},{"$f":"IF(Invoeren!$G$9=\"\",\"\",INDEX('B. Lijsten'!$C$32:$G$36,MATCH(Invoeren!$G$9,'B. Lijsten'!$C$32:$C$36,0),MATCH($AN45,'B. Lijsten'!$D$31:$G$31,0)+1))","v":""},null,{"$f":"VLOOKUP(D45,Table1[[Warmtebron & type net]:[Energiearmoede verergerd?]],16,FALSE)","v":"Middelgrote dorpen en/of compacte wijken"},{"$f":"IF(Invoeren!$G$33=\"\",\"\",INDEX('B. Lijsten'!$C$48:$H$51,MATCH(Invoeren!$G$33,'B. Lijsten'!$C$48:$C$51,0),MATCH($AR45,'B. Lijsten'!$D$47:$H$47,0)+1))","v":""}]
[44,{"$f":"'C. Warmtetechnieken'!A45","v":"Zonthermische panelen"},{"$f":"'C. Warmtetechnieken'!B45","v":"Bronnet"},"Bronnet - Zonthermische panelen","Een MT-warmtenet op basis van gedeelde zonnecollectoren met een decentrale warmtepomp","Zonthermie","Een MT-warmtenet op basis van gedeelde zonnecollectoren met een decentrale warmtepomp",null,null,{"$f":"AVERAGE(\nIF(ISNUMBER(AG46) * (AG46<>0), AG46*'B. Lijsten'!$L$9),\nIF(ISNUMBER(AI46) * (AI46<>0), AI46*'B. Lijsten'!$L$11),\nIF(ISNUMBER(AK46) * (AK46<>0), AK46*'B. Lijsten'!$L$10),\nIF(ISNUMBER(AM46) * (AM46<>0), AM46*'B. Lijsten'!$L$5),\nIF(ISNUMBER(AO46) * (AO46<>0), AO46*'B. Lijsten'!$L$3),\nIF(ISNUMBER(AP46) * (AP46<>0), AP46*'B. Lijsten'!$L$4),\nIF(ISNUMBER(AS46) * (AS46<>0), AS46)\n)","v":0},0.9,0,0,null,null,null,null,null,null,null,null,1,{"$f":"IF(AND(AL46=0,Invoeren!$G$28=\"Ja\"),0,1)","v":1},"",{"$f":"IF('C. Warmtetechnieken'!L45=\"Individueel\",1,\nIF('C. Warmtetechnieken'!L45=\"Klein\",\"2 tot 200\",\nIF('C. Warmtetechnieken'!L45=\"Middel\",\"200 tot 500\",\nIF('C. Warmtetechnieken'!L45=\"Middelgroot\",\"500 tot 1500\",\nIF('C. Warmtetechnieken'!L45=\"Groot\",\"1500 tot 5000\",\nIF('C. Warmtetechnieken'!L45=\"Zeer groot\",\"Meer dan 5000\",\n\"\"))))))","v":"500 tot 1500"},4,{"$f":"IF(Invoeren!$G$32=1,1,\nIF(Invoeren!$G$32=\"2 tot 200\",2,\nIF(Invoeren!$G$32=\"200 tot 500\",3,\nIF(Invoeren!$G$32=\"500 tot 1500\",4,\nIF(Invoeren!$G$32=\"1500 tot 5000\",5,\nIF(Invoeren!$G$32=\"Meer dan 5000\",6,\n\"\"))))))","v":""},{"$f":"IF(Invoeren!$G$34=\"Ja\",1,0)","v":0},{"$f":"IF(Invoeren!$G$35=1,1,\nIF(Invoeren!$G$35=\"2 tot 200\",2,\nIF(Invoeren!$G$35=\"200 tot 500\",3,\nIF(Invoeren!$G$35=\"500 tot 1500\",4,\nIF(Invoeren!$G$35=\"1500 tot 5000\",5,\nIF(Invoeren!$G$35=\"Meer dan 5000\",6,\n\"\"))))))","v":""},0,null,{"$f":"IF(Invoeren!$G$20=\"\",\"\",IF(Invoeren!$G$29=\"\",\"Geen restwarmtebron\",INDEX('B. Lijsten'!$C$44:$G$46, MATCH(Invoeren!$G$20, 'B. Lijsten'!$C$44:$C$46, 0), MATCH($AE46, 'B. Lijsten'!$D$43:$G$43, 0) + 1)))","v":""},{"$f":"IF(Invoeren!$G$27=\"\",\"\",INDEX('B. Lijsten'!$C$17:$F$18, MATCH(Invoeren!$G$27, 'B. Lijsten'!$C$17:$C$18, 0), MATCH('A. Breakdown'!$C46, 'B. Lijsten'!$D$16:$F$16, 0) + 1))","v":""},{"$f":"IF('C. Warmtetechnieken'!O45=\"Nee\",1,0)","v":1},{"$f":"IF(Invoeren!$G$29=\"\",\"\",INDEX('B. Lijsten'!$C$25:$E$26, MATCH(Invoeren!$G$29, 'B. Lijsten'!$C$25:$C$26, 0), MATCH('A. Breakdown'!$AH46, 'B. Lijsten'!$D$24:$E$24, 0) + 1))","v":""},{"$f":"IF('C. Warmtetechnieken'!P45=\"Nee\",1,0)","v":1},{"$f":"IF(W46=0,\"\",IF(Invoeren!$G$28=\"\",\"\",INDEX('B. Lijsten'!$C$21:$E$22,MATCH(Invoeren!$G$28,'B. Lijsten'!$C$21:$C$22,0),MATCH('A. Breakdown'!$AJ46,'B. Lijsten'!$D$20:$E$20,0)+1)))","v":""},1,{"$f":"IF(Invoeren!$G$12=\"\",\"\",INDEX('B. Lijsten'!$C$38:$F$42, MATCH(Invoeren!$G$12, 'B. Lijsten'!$C$38:$C$42, 0), MATCH('A. Breakdown'!$C46, 'B. Lijsten'!$D$37:$F$37, 0) + 1))","v":""},{"$f":"'C. Warmtetechnieken'!G45","v":"MT"},{"$f":"IF(Invoeren!$G$8=\"\",\"\",INDEX('B. Lijsten'!$C$28:$G$30,MATCH(Invoeren!$G$8,'B. Lijsten'!$C$28:$C$30,0),MATCH($AN46,'B. Lijsten'!$D$27:$G$27,0)+1))","v":""},{"$f":"IF(Invoeren!$G$9=\"\",\"\",INDEX('B. Lijsten'!$C$32:$G$36,MATCH(Invoeren!$G$9,'B. Lijsten'!$C$32:$C$36,0),MATCH($AN46,'B. Lijsten'!$D$31:$G$31,0)+1))","v":""},null,{"$f":"VLOOKUP(D46,Table1[[Warmtebron & type net]:[Energiearmoede verergerd?]],16,FALSE)","v":"Middelgrote dorpen en/of compacte wijken"},{"$f":"IF(Invoeren!$G$33=\"\",\"\",INDEX('B. Lijsten'!$C$48:$H$51,MATCH(Invoeren!$G$33,'B. Lijsten'!$C$48:$C$51,0),MATCH($AR46,'B. Lijsten'!$D$47:$H$47,0)+1))","v":""}]
[45,{"$f":"'C. Warmtetechnieken'!A46","v":"Zonthermische panelen"},{"$f":"'C. Warmtetechnieken'!B46","v":"Warmtenet"},"Warmtenet - Zonthermische panelen","Een MT-warmtenet op basis van zonnecollectoren met een centrale warmtepomp","Zonthermie","Een MT-warmtenet op basis van zonnecollectoren met een centrale warmtepomp",null,null,{"$f":"AVERAGE(\nIF(ISNUMBER(AG47) * (AG47<>0), AG47*'B. Lijsten'!$L$9),\nIF(ISNUMBER(AI47) * (AI47<>0), AI47*'B. Lijsten'!$L$11),\nIF(ISNUMBER(AK47) * (AK47<>0), AK47*'B. Lijsten'!$L$10),\nIF(ISNUMBER(AM47) * (AM47<>0), AM47*'B. Lijsten'!$L$5),\nIF(ISNUMBER(AO47) * (AO47<>0), AO47*'B. Lijsten'!$L$3),\nIF(ISNUMBER(AP47) * (AP47<>0), AP47*'B. Lijsten'!$L$4),\nIF(ISNUMBER(AS47) * (AS47<>0), AS47)\n)","v":0},0.9,0,0,null,null,null,null,null,null,null,null,1,{"$f":"IF(AND(AL47=0,Invoeren!$G$28=\"Ja\"),0,1)","v":1},"",{"$f":"IF('C. Warmtetechnieken'!L46=\"Individueel\",1,\nIF('C. Warmtetechnieken'!L46=\"Klein\",\"2 tot 200\",\nIF('C. Warmtetechnieken'!L46=\"Middel\",\"200 tot 500\",\nIF('C. Warmtetechnieken'!L46=\"Middelgroot\",\"500 tot 1500\",\nIF('C. Warmtetechnieken'!L46=\"Groot\",\"1500 tot 5000\",\nIF('C. Warmtetechnieken'!L46=\"Zeer groot\",\"Meer dan 5000\",\n\"\"))))))","v":"500 tot 1500"},4,{"$f":"IF(Invoeren!$G$32=1,1,\nIF(Invoeren!$G$32=\"2 tot 200\",2,\nIF(Invoeren!$G$32=\"200 tot 500\",3,\nIF(Invoeren!$G$32=\"500 tot 1500\",4,\nIF(Invoeren!$G$32=\"1500 tot 5000\",5,\nIF(Invoeren!$G$32=\"Meer dan 5000\",6,\n\"\"))))))","v":""},{"$f":"IF(Invoeren!$G$34=\"Ja\",1,0)","v":0},{"$f":"IF(Invoeren!$G$35=1,1,\nIF(Invoeren!$G$35=\"2 tot 200\",2,\nIF(Invoeren!$G$35=\"200 tot 500\",3,\nIF(Invoeren!$G$35=\"500 tot 1500\",4,\nIF(Invoeren!$G$35=\"1500 tot 5000\",5,\nIF(Invoeren!$G$35=\"Meer dan 5000\",6,\n\"\"))))))","v":""},0,null,{"$f":"IF(Invoeren!$G$20=\"\",\"\",IF(Invoeren!$G$29=\"\",\"Geen restwarmtebron\",INDEX('B. Lijsten'!$C$44:$G$46, MATCH(Invoeren!$G$20, 'B. Lijsten'!$C$44:$C$46, 0), MATCH($AE47, 'B. Lijsten'!$D$43:$G$43, 0) + 1)))","v":""},{"$f":"IF(Invoeren!$G$27=\"\",\"\",INDEX('B. Lijsten'!$C$17:$F$18, MATCH(Invoeren!$G$27, 'B. Lijsten'!$C$17:$C$18, 0), MATCH('A. Breakdown'!$C47, 'B. Lijsten'!$D$16:$F$16, 0) + 1))","v":""},{"$f":"IF('C. Warmtetechnieken'!O46=\"Nee\",1,0)","v":1},{"$f":"IF(Invoeren!$G$29=\"\",\"\",INDEX('B. Lijsten'!$C$25:$E$26, MATCH(Invoeren!$G$29, 'B. Lijsten'!$C$25:$C$26, 0), MATCH('A. Breakdown'!$AH47, 'B. Lijsten'!$D$24:$E$24, 0) + 1))","v":""},{"$f":"IF('C. Warmtetechnieken'!P46=\"Nee\",1,0)","v":1},{"$f":"IF(W47=0,\"\",IF(Invoeren!$G$28=\"\",\"\",INDEX('B. Lijsten'!$C$21:$E$22,MATCH(Invoeren!$G$28,'B. Lijsten'!$C$21:$C$22,0),MATCH('A. Breakdown'!$AJ47,'B. Lijsten'!$D$20:$E$20,0)+1)))","v":""},1,{"$f":"IF(Invoeren!$G$12=\"\",\"\",INDEX('B. Lijsten'!$C$38:$F$42, MATCH(Invoeren!$G$12, 'B. Lijsten'!$C$38:$C$42, 0), MATCH('A. Breakdown'!$C47, 'B. Lijsten'!$D$37:$F$37, 0) + 1))","v":""},{"$f":"'C. Warmtetechnieken'!G46","v":"MT"},{"$f":"IF(Invoeren!$G$8=\"\",\"\",INDEX('B. Lijsten'!$C$28:$G$30,MATCH(Invoeren!$G$8,'B. Lijsten'!$C$28:$C$30,0),MATCH($AN47,'B. Lijsten'!$D$27:$G$27,0)+1))","v":""},{"$f":"IF(Invoeren!$G$9=\"\",\"\",INDEX('B. Lijsten'!$C$32:$G$36,MATCH(Invoeren!$G$9,'B. Lijsten'!$C$32:$C$36,0),MATCH($AN47,'B. Lijsten'!$D$31:$G$31,0)+1))","v":""},null,{"$f":"VLOOKUP(D47,Table1[[Warmtebron & type net]:[Energiearmoede verergerd?]],16,FALSE)","v":"Middelgrote dorpen en/of compacte wijken"},{"$f":"IF(Invoeren!$G$33=\"\",\"\",INDEX('B. Lijsten'!$C$48:$H$51,MATCH(Invoeren!$G$33,'B. Lijsten'!$C$48:$C$51,0),MATCH($AR47,'B. Lijsten'!$D$47:$H$47,0)+1))","v":""}]
[46,{"$f":"'C. Warmtetechnieken'!A47","v":"Zonthermische panelen + HTO"},{"$f":"'C. Warmtetechnieken'!B47","v":"Warmtenet"},"Warmtenet - Zonthermische panelen + HTO","Een MT-warmtenet op basis van zonnecollectoren, inclusief HTO (hoge temperatuursopslag)","Zonthermie","Een MT-warmtenet op basis van zonnecollectoren, inclusief HTO (hoge temperatuursopslag)",null,null,{"$f":"AVERAGE(\nIF(ISNUMBER(AG48) * (AG48<>0), AG48*'B. Lijsten'!$L$9),\nIF(ISNUMBER(AI48) * (AI48<>0), AI48*'B. Lijsten'!$L$11),\nIF(ISNUMBER(AK48) * (AK48<>0), AK48*'B. Lijsten'!$L$10),\nIF(ISNUMBER(AM48) * (AM48<>0), AM48*'B. Lijsten'!$L$5),\nIF(ISNUMBER(AO48) * (AO48<>0), AO48*'B. Lijsten'!$L$3),\nIF(ISNUMBER(AP48) * (AP48<>0), AP48*'B. Lijsten'!$L$4),\nIF(ISNUMBER(AS48) * (AS48<>0), AS48)\n)","v":0},0.9,0,0,null,null,null,null,null,null,null,null,1,{"$f":"IF(AND(AL48=0,Invoeren!$G$28=\"Ja\"),0,1)","v":1},"",{"$f":"IF('C. Warmtetechnieken'!L47=\"Individueel\",1,\nIF('C. Warmtetechnieken'!L47=\"Klein\",\"2 tot 200\",\nIF('C. Warmtetechnieken'!L47=\"Middel\",\"200 tot 500\",\nIF('C. Warmtetechnieken'!L47=\"Middelgroot\",\"500 tot 1500\",\nIF('C. Warmtetechnieken'!L47=\"Groot\",\"1500 tot 5000\",\nIF('C. Warmtetechnieken'!L47=\"Zeer groot\",\"Meer dan 5000\",\n\"\"))))))","v":"500 tot 1500"},4,{"$f":"IF(Invoeren!$G$32=1,1,\nIF(Invoeren!$G$32=\"2 tot 200\",2,\nIF(Invoeren!$G$32=\"200 tot 500\",3,\nIF(Invoeren!$G$32=\"500 tot 1500\",4,\nIF(Invoeren!$G$32=\"1500 tot 5000\",5,\nIF(Invoeren!$G$32=\"Meer dan 5000\",6,\n\"\"))))))","v":""},{"$f":"IF(Invoeren!$G$34=\"Ja\",1,0)","v":0},{"$f":"IF(Invoeren!$G$35=1,1,\nIF(Invoeren!$G$35=\"2 tot 200\",2,\nIF(Invoeren!$G$35=\"200 tot 500\",3,\nIF(Invoeren!$G$35=\"500 tot 1500\",4,\nIF(Invoeren!$G$35=\"1500 tot 5000\",5,\nIF(Invoeren!$G$35=\"Meer dan 5000\",6,\n\"\"))))))","v":""},0,null,{"$f":"IF(Invoeren!$G$20=\"\",\"\",IF(Invoeren!$G$29=\"\",\"Geen restwarmtebron\",INDEX('B. Lijsten'!$C$44:$G$46, MATCH(Invoeren!$G$20, 'B. Lijsten'!$C$44:$C$46, 0), MATCH($AE48, 'B. Lijsten'!$D$43:$G$43, 0) + 1)))","v":""},{"$f":"IF(Invoeren!$G$27=\"\",\"\",INDEX('B. Lijsten'!$C$17:$F$18, MATCH(Invoeren!$G$27, 'B. Lijsten'!$C$17:$C$18, 0), MATCH('A. Breakdown'!$C48, 'B. Lijsten'!$D$16:$F$16, 0) + 1))","v":""},{"$f":"IF('C. Warmtetechnieken'!O47=\"Nee\",1,0)","v":1},{"$f":"IF(Invoeren!$G$29=\"\",\"\",INDEX('B. Lijsten'!$C$25:$E$26, MATCH(Invoeren!$G$29, 'B. Lijsten'!$C$25:$C$26, 0), MATCH('A. Breakdown'!$AH48, 'B. Lijsten'!$D$24:$E$24, 0) + 1))","v":""},{"$f":"IF('C. Warmtetechnieken'!P47=\"Nee\",1,0)","v":0},{"$f":"IF(W48=0,\"\",IF(Invoeren!$G$28=\"\",\"\",INDEX('B. Lijsten'!$C$21:$E$22,MATCH(Invoeren!$G$28,'B. Lijsten'!$C$21:$C$22,0),MATCH('A. Breakdown'!$AJ48,'B. Lijsten'!$D$20:$E$20,0)+1)))","v":""},0,{"$f":"IF(Invoeren!$G$12=\"\",\"\",INDEX('B. Lijsten'!$C$38:$F$42, MATCH(Invoeren!$G$12, 'B. Lijsten'!$C$38:$C$42, 0), MATCH('A. Breakdown'!$C48, 'B. Lijsten'!$D$37:$F$37, 0) + 1))","v":""},{"$f":"'C. Warmtetechnieken'!G47","v":"MT"},{"$f":"IF(Invoeren!$G$8=\"\",\"\",INDEX('B. Lijsten'!$C$28:$G$30,MATCH(Invoeren!$G$8,'B. Lijsten'!$C$28:$C$30,0),MATCH($AN48,'B. Lijsten'!$D$27:$G$27,0)+1))","v":""},{"$f":"IF(Invoeren!$G$9=\"\",\"\",INDEX('B. Lijsten'!$C$32:$G$36,MATCH(Invoeren!$G$9,'B. Lijsten'!$C$32:$C$36,0),MATCH($AN48,'B. Lijsten'!$D$31:$G$31,0)+1))","v":""},null,{"$f":"VLOOKUP(D48,Table1[[Warmtebron & type net]:[Energiearmoede verergerd?]],16,FALSE)","v":"Middelgrote dorpen en/of compacte wijken"},{"$f":"IF(Invoeren!$G$33=\"\",\"\",INDEX('B. Lijsten'!$C$48:$H$51,MATCH(Invoeren!$G$33,'B. Lijsten'!$C$48:$C$51,0),MATCH($AR48,'B. Lijsten'!$D$47:$H$47,0)+1))","v":""}]
[47,{"$f":"'C. Warmtetechnieken'!A48","v":"Gesloten bodemenergie​ MT"},{"$f":"'C. Warmtetechnieken'!B48","v":"Warmtenet"},"Warmtenet - Gesloten bodemenergie​ MT","Een MT-warmtenet op basis van een gesloten bodemenergie systeem / bodemlus (WKO)","Gesloten bodemlus","Een MT-warmtenet op basis van een gesloten bodemenergie systeem / bodemlus (WKO)",null,null,{"$f":"AVERAGE(\nIF(ISNUMBER(AG49) * (AG49<>0), AG49*'B. Lijsten'!$L$9),\nIF(ISNUMBER(AI49) * (AI49<>0), AI49*'B. Lijsten'!$L$11),\nIF(ISNUMBER(AK49) * (AK49<>0), AK49*'B. Lijsten'!$L$10),\nIF(ISNUMBER(AM49) * (AM49<>0), AM49*'B. Lijsten'!$L$5),\nIF(ISNUMBER(AO49) * (AO49<>0), AO49*'B. Lijsten'!$L$3),\nIF(ISNUMBER(AP49) * (AP49<>0), AP49*'B. Lijsten'!$L$4),\nIF(ISNUMBER(AS49) * (AS49<>0), AS49)\n)","v":0},1,0,0,null,null,null,null,null,null,null,null,1,{"$f":"IF(AND(AL49=0,Invoeren!$G$28=\"Ja\"),0,1)","v":1},"",{"$f":"IF('C. Warmtetechnieken'!L48=\"Individueel\",1,\nIF('C. Warmtetechnieken'!L48=\"Klein\",\"2 tot 200\",\nIF('C. Warmtetechnieken'!L48=\"Middel\",\"200 tot 500\",\nIF('C. Warmtetechnieken'!L48=\"Middelgroot\",\"500 tot 1500\",\nIF('C. Warmtetechnieken'!L48=\"Groot\",\"1500 tot 5000\",\nIF('C. Warmtetechnieken'!L48=\"Zeer groot\",\"Meer dan 5000\",\n\"\"))))))","v":"2 tot 200"},2,{"$f":"IF(Invoeren!$G$32=1,1,\nIF(Invoeren!$G$32=\"2 tot 200\",2,\nIF(Invoeren!$G$32=\"200 tot 500\",3,\nIF(Invoeren!$G$32=\"500 tot 1500\",4,\nIF(Invoeren!$G$32=\"1500 tot 5000\",5,\nIF(Invoeren!$G$32=\"Meer dan 5000\",6,\n\"\"))))))","v":""},{"$f":"IF(Invoeren!$G$34=\"Ja\",1,0)","v":0},{"$f":"IF(Invoeren!$G$35=1,1,\nIF(Invoeren!$G$35=\"2 tot 200\",2,\nIF(Invoeren!$G$35=\"200 tot 500\",3,\nIF(Invoeren!$G$35=\"500 tot 1500\",4,\nIF(Invoeren!$G$35=\"1500 tot 5000\",5,\nIF(Invoeren!$G$35=\"Meer dan 5000\",6,\n\"\"))))))","v":""},0,null,{"$f":"IF(Invoeren!$G$20=\"\",\"\",IF(Invoeren!$G$29=\"\",\"Geen restwarmtebron\",INDEX('B. Lijsten'!$C$44:$G$46, MATCH(Invoeren!$G$20, 'B. Lijsten'!$C$44:$C$46, 0), MATCH($AE49, 'B. Lijsten'!$D$43:$G$43, 0) + 1)))","v":""},{"$f":"IF(Invoeren!$G$27=\"\",\"\",INDEX('B. Lijsten'!$C$17:$F$18, MATCH(Invoeren!$G$27, 'B. Lijsten'!$C$17:$C$18, 0), MATCH('A. Breakdown'!$C49, 'B. Lijsten'!$D$16:$F$16, 0) + 1))","v":""},{"$f":"IF('C. Warmtetechnieken'!O48=\"Nee\",1,0)","v":1},{"$f":"IF(Invoeren!$G$29=\"\",\"\",INDEX('B. Lijsten'!$C$25:$E$26, MATCH(Invoeren!$G$29, 'B. Lijsten'!$C$25:$C$26, 0), MATCH('A. Breakdown'!$AH49, 'B. Lijsten'!$D$24:$E$24, 0) + 1))","v":""},{"$f":"IF('C. Warmtetechnieken'!P48=\"Nee\",1,0)","v":0},{"$f":"IF(W49=0,\"\",IF(Invoeren!$G$28=\"\",\"\",INDEX('B. Lijsten'!$C$21:$E$22,MATCH(Invoeren!$G$28,'B. Lijsten'!$C$21:$C$22,0),MATCH('A. Breakdown'!$AJ49,'B. Lijsten'!$D$20:$E$20,0)+1)))","v":""},0,{"$f":"IF(Invoeren!$G$12=\"\",\"\",INDEX('B. Lijsten'!$C$38:$F$42, MATCH(Invoeren!$G$12, 'B. Lijsten'!$C$38:$C$42, 0), MATCH('A. Breakdown'!$C49, 'B. Lijsten'!$D$37:$F$37, 0) + 1))","v":""},{"$f":"'C. Warmtetechnieken'!G48","v":"MT"},{"$f":"IF(Invoeren!$G$8=\"\",\"\",INDEX('B. Lijsten'!$C$28:$G$30,MATCH(Invoeren!$G$8,'B. Lijsten'!$C$28:$C$30,0),MATCH($AN49,'B. Lijsten'!$D$27:$G$27,0)+1))","v":""},{"$f":"IF(Invoeren!$G$9=\"\",\"\",INDEX('B. Lijsten'!$C$32:$G$36,MATCH(Invoeren!$G$9,'B. Lijsten'!$C$32:$C$36,0),MATCH($AN49,'B. Lijsten'!$D$31:$G$31,0)+1))","v":""},null,{"$f":"VLOOKUP(D49,Table1[[Warmtebron & type net]:[Energiearmoede verergerd?]],16,FALSE)","v":"Middelgrote dorpen en/of compacte wijken"},{"$f":"IF(Invoeren!$G$33=\"\",\"\",INDEX('B. Lijsten'!$C$48:$H$51,MATCH(Invoeren!$G$33,'B. Lijsten'!$C$48:$C$51,0),MATCH($AR49,'B. Lijsten'!$D$47:$H$47,0)+1))","v":""}]
[48,{"$f":"'C. Warmtetechnieken'!A49","v":"Sportveld thermie MT (met WKO)"},{"$f":"'C. Warmtetechnieken'!B49","v":"Warmtenet"},"Warmtenet - Sportveld thermie MT (met WKO)","Een MT-warmtenet op basis van sportveld thermie, inclusief WKO","Sportveld thermie","Een MT-warmtenet op basis van sportveld thermie, inclusief WKO",null,null,{"$f":"AVERAGE(\nIF(ISNUMBER(AG50) * (AG50<>0), AG50*'B. Lijsten'!$L$9),\nIF(ISNUMBER(AI50) * (AI50<>0), AI50*'B. Lijsten'!$L$11),\nIF(ISNUMBER(AK50) * (AK50<>0), AK50*'B. Lijsten'!$L$10),\nIF(ISNUMBER(AM50) * (AM50<>0), AM50*'B. Lijsten'!$L$5),\nIF(ISNUMBER(AO50) * (AO50<>0), AO50*'B. Lijsten'!$L$3),\nIF(ISNUMBER(AP50) * (AP50<>0), AP50*'B. Lijsten'!$L$4),\nIF(ISNUMBER(AS50) * (AS50<>0), AS50)\n)","v":0},0.8,0,0,null,null,null,null,null,null,null,null,1,{"$f":"IF(AND(AL50=0,Invoeren!$G$28=\"Ja\"),0,1)","v":1},"",{"$f":"IF('C. Warmtetechnieken'!L49=\"Individueel\",1,\nIF('C. Warmtetechnieken'!L49=\"Klein\",\"2 tot 200\",\nIF('C. Warmtetechnieken'!L49=\"Middel\",\"200 tot 500\",\nIF('C. Warmtetechnieken'!L49=\"Middelgroot\",\"500 tot 1500\",\nIF('C. Warmtetechnieken'!L49=\"Groot\",\"1500 tot 5000\",\nIF('C. Warmtetechnieken'!L49=\"Zeer groot\",\"Meer dan 5000\",\n\"\"))))))","v":"200 tot 500"},3,{"$f":"IF(Invoeren!$G$32=1,1,\nIF(Invoeren!$G$32=\"2 tot 200\",2,\nIF(Invoeren!$G$32=\"200 tot 500\",3,\nIF(Invoeren!$G$32=\"500 tot 1500\",4,\nIF(Invoeren!$G$32=\"1500 tot 5000\",5,\nIF(Invoeren!$G$32=\"Meer dan 5000\",6,\n\"\"))))))","v":""},{"$f":"IF(Invoeren!$G$34=\"Ja\",1,0)","v":0},{"$f":"IF(Invoeren!$G$35=1,1,\nIF(Invoeren!$G$35=\"2 tot 200\",2,\nIF(Invoeren!$G$35=\"200 tot 500\",3,\nIF(Invoeren!$G$35=\"500 tot 1500\",4,\nIF(Invoeren!$G$35=\"1500 tot 5000\",5,\nIF(Invoeren!$G$35=\"Meer dan 5000\",6,\n\"\"))))))","v":""},0,null,{"$f":"IF(Invoeren!$G$20=\"\",\"\",IF(Invoeren!$G$29=\"\",\"Geen restwarmtebron\",INDEX('B. Lijsten'!$C$44:$G$46, MATCH(Invoeren!$G$20, 'B. Lijsten'!$C$44:$C$46, 0), MATCH($AE50, 'B. Lijsten'!$D$43:$G$43, 0) + 1)))","v":""},{"$f":"IF(Invoeren!$G$27=\"\",\"\",INDEX('B. Lijsten'!$C$17:$F$18, MATCH(Invoeren!$G$27, 'B. Lijsten'!$C$17:$C$18, 0), MATCH('A. Breakdown'!$C50, 'B. Lijsten'!$D$16:$F$16, 0) + 1))","v":""},{"$f":"IF('C. Warmtetechnieken'!O49=\"Nee\",1,0)","v":1},{"$f":"IF(Invoeren!$G$29=\"\",\"\",INDEX('B. Lijsten'!$C$25:$E$26, MATCH(Invoeren!$G$29, 'B. Lijsten'!$C$25:$C$26, 0), MATCH('A. Breakdown'!$AH50, 'B. Lijsten'!$D$24:$E$24, 0) + 1))","v":""},{"$f":"IF('C. Warmtetechnieken'!P49=\"Nee\",1,0)","v":0},{"$f":"IF(W50=0,\"\",IF(Invoeren!$G$28=\"\",\"\",INDEX('B. Lijsten'!$C$21:$E$22,MATCH(Invoeren!$G$28,'B. Lijsten'!$C$21:$C$22,0),MATCH('A. Breakdown'!$AJ50,'B. Lijsten'!$D$20:$E$20,0)+1)))","v":""},0,{"$f":"IF(Invoeren!$G$12=\"\",\"\",INDEX('B. Lijsten'!$C$38:$F$42, MATCH(Invoeren!$G$12, 'B. Lijsten'!$C$38:$C$42, 0), MATCH('A. Breakdown'!$C50, 'B. Lijsten'!$D$37:$F$37, 0) + 1))","v":""},{"$f":"'C. Warmtetechnieken'!G49","v":"MT"},{"$f":"IF(Invoeren!$G$8=\"\",\"\",INDEX('B. Lijsten'!$C$28:$G$30,MATCH(Invoeren!$G$8,'B. Lijsten'!$C$28:$C$30,0),MATCH($AN50,'B. Lijsten'!$D$27:$G$27,0)+1))","v":""},{"$f":"IF(Invoeren!$G$9=\"\",\"\",INDEX('B. Lijsten'!$C$32:$G$36,MATCH(Invoeren!$G$9,'B. Lijsten'!$C$32:$C$36,0),MATCH($AN50,'B. Lijsten'!$D$31:$G$31,0)+1))","v":""},null,{"$f":"VLOOKUP(D50,Table1[[Warmtebron & type net]:[Energiearmoede verergerd?]],16,FALSE)","v":"Middelgrote dorpen en/of compacte wijken"},{"$f":"IF(Invoeren!$G$33=\"\",\"\",INDEX('B. Lijsten'!$C$48:$H$51,MATCH(Invoeren!$G$33,'B. Lijsten'!$C$48:$C$51,0),MATCH($AR50,'B. Lijsten'!$D$47:$H$47,0)+1))","v":""}]
[49,{"$f":"'C. Warmtetechnieken'!A50","v":"Thermische energie uit afvalwater - leidingen (TEA)​ MT"},{"$f":"'C. Warmtetechnieken'!B50","v":"Warmtenet"},"Warmtenet - Thermische energie uit afvalwater - leidingen (TEA)​ MT","Een MT-warmtenet op basis van afvalwater aquathermie (TEA) uit leidingen","Afvalwater aquathermie (TEA)","Een MT-warmtenet op basis van afvalwater aquathermie (TEA) uit leidingen",null,null,{"$f":"AVERAGE(\nIF(ISNUMBER(AG51) * (AG51<>0), AG51*'B. Lijsten'!$L$9),\nIF(ISNUMBER(AI51) * (AI51<>0), AI51*'B. Lijsten'!$L$11),\nIF(ISNUMBER(AK51) * (AK51<>0), AK51*'B. Lijsten'!$L$10),\nIF(ISNUMBER(AM51) * (AM51<>0), AM51*'B. Lijsten'!$L$5),\nIF(ISNUMBER(AO51) * (AO51<>0), AO51*'B. Lijsten'!$L$3),\nIF(ISNUMBER(AP51) * (AP51<>0), AP51*'B. Lijsten'!$L$4),\nIF(ISNUMBER(AS51) * (AS51<>0), AS51)\n)","v":0},1,0,0,{"$f":"IF(Invoeren!$G$15=\"Ja\",1,0)","v":0},null,null,{"$f":"IF(Invoeren!$G$19=\"Ja\",1,0)","v":0},null,{"$f":"IF(Invoeren!$G$23=\"Ja\",1,0)","v":0},null,null,null,{"$f":"IF(AND(AL51=0,Invoeren!$G$28=\"Ja\"),0,1)","v":1},"",{"$f":"IF('C. Warmtetechnieken'!L50=\"Individueel\",1,\nIF('C. Warmtetechnieken'!L50=\"Klein\",\"2 tot 200\",\nIF('C. Warmtetechnieken'!L50=\"Middel\",\"200 tot 500\",\nIF('C. Warmtetechnieken'!L50=\"Middelgroot\",\"500 tot 1500\",\nIF('C. Warmtetechnieken'!L50=\"Groot\",\"1500 tot 5000\",\nIF('C. Warmtetechnieken'!L50=\"Zeer groot\",\"Meer dan 5000\",\n\"\"))))))","v":"200 tot 500"},3,{"$f":"IF(Invoeren!$G$32=1,1,\nIF(Invoeren!$G$32=\"2 tot 200\",2,\nIF(Invoeren!$G$32=\"200 tot 500\",3,\nIF(Invoeren!$G$32=\"500 tot 1500\",4,\nIF(Invoeren!$G$32=\"1500 tot 5000\",5,\nIF(Invoeren!$G$32=\"Meer dan 5000\",6,\n\"\"))))))","v":""},{"$f":"IF(Invoeren!$G$34=\"Ja\",1,0)","v":0},{"$f":"IF(Invoeren!$G$35=1,1,\nIF(Invoeren!$G$35=\"2 tot 200\",2,\nIF(Invoeren!$G$35=\"200 tot 500\",3,\nIF(Invoeren!$G$35=\"500 tot 1500\",4,\nIF(Invoeren!$G$35=\"1500 tot 5000\",5,\nIF(Invoeren!$G$35=\"Meer dan 5000\",6,\n\"\"))))))","v":""},0,null,{"$f":"IF(Invoeren!$G$20=\"\",\"\",IF(Invoeren!$G$29=\"\",\"Geen restwarmtebron\",INDEX('B. Lijsten'!$C$44:$G$46, MATCH(Invoeren!$G$20, 'B. Lijsten'!$C$44:$C$46, 0), MATCH($AE51, 'B. Lijsten'!$D$43:$G$43, 0) + 1)))","v":""},{"$f":"IF(Invoeren!$G$27=\"\",\"\",INDEX('B. Lijsten'!$C$17:$F$18, MATCH(Invoeren!$G$27, 'B. Lijsten'!$C$17:$C$18, 0), MATCH('A. Breakdown'!$C51, 'B. Lijsten'!$D$16:$F$16, 0) + 1))","v":""},{"$f":"IF('C. Warmtetechnieken'!O50=\"Nee\",1,0)","v":1},{"$f":"IF(Invoeren!$G$29=\"\",\"\",INDEX('B. Lijsten'!$C$25:$E$26, MATCH(Invoeren!$G$29, 'B. Lijsten'!$C$25:$C$26, 0), MATCH('A. Breakdown'!$AH51, 'B. Lijsten'!$D$24:$E$24, 0) + 1))","v":""},{"$f":"IF('C. Warmtetechnieken'!P50=\"Nee\",1,0)","v":0},{"$f":"IF(W51=0,\"\",IF(Invoeren!$G$28=\"\",\"\",INDEX('B. Lijsten'!$C$21:$E$22,MATCH(Invoeren!$G$28,'B. Lijsten'!$C$21:$C$22,0),MATCH('A. Breakdown'!$AJ51,'B. Lijsten'!$D$20:$E$20,0)+1)))","v":""},0,{"$f":"IF(Invoeren!$G$12=\"\",\"\",INDEX('B. Lijsten'!$C$38:$F$42, MATCH(Invoeren!$G$12, 'B. Lijsten'!$C$38:$C$42, 0), MATCH('A. Breakdown'!$C51, 'B. Lijsten'!$D$37:$F$37, 0) + 1))","v":""},{"$f":"'C. Warmtetechnieken'!G50","v":"MT"},{"$f":"IF(Invoeren!$G$8=\"\",\"\",INDEX('B. Lijsten'!$C$28:$G$30,MATCH(Invoeren!$G$8,'B. Lijsten'!$C$28:$C$30,0),MATCH($AN51,'B. Lijsten'!$D$27:$G$27,0)+1))","v":""},{"$f":"IF(Invoeren!$G$9=\"\",\"\",INDEX('B. Lijsten'!$C$32:$G$36,MATCH(Invoeren!$G$9,'B. Lijsten'!$C$32:$C$36,0),MATCH($AN51,'B. Lijsten'!$D$31:$G$31,0)+1))","v":""},null,{"$f":"VLOOKUP(D51,Table1[[Warmtebron & type net]:[Energiearmoede verergerd?]],16,FALSE)","v":"Middelgrote dorpen en/of compacte wijken"},{"$f":"IF(Invoeren!$G$33=\"\",\"\",INDEX('B. Lijsten'!$C$48:$H$51,MATCH(Invoeren!$G$33,'B. Lijsten'!$C$48:$C$51,0),MATCH($AR51,'B. Lijsten'!$D$47:$H$47,0)+1))","v":""}]
[50,{"$f":"'C. Warmtetechnieken'!A51","v":"Thermische energie uit afvalwater - RWZI (TEA)​ MT"},{"$f":"'C. Warmtetechnieken'!B51","v":"Warmtenet"},"Warmtenet - Thermische energie uit afvalwater - RWZI (TEA)​ MT","Een MT-warmtenet op basis van afvalwater aquathermie (TEA) uit de RWZI","Afvalwater aquathermie (TEA)","Een MT-warmtenet op basis van afvalwater aquathermie (TEA) uit de RWZI",null,null,{"$f":"AVERAGE(\nIF(ISNUMBER(AG52) * (AG52<>0), AG52*'B. Lijsten'!$L$9),\nIF(ISNUMBER(AI52) * (AI52<>0), AI52*'B. Lijsten'!$L$11),\nIF(ISNUMBER(AK52) * (AK52<>0), AK52*'B. Lijsten'!$L$10),\nIF(ISNUMBER(AM52) * (AM52<>0), AM52*'B. Lijsten'!$L$5),\nIF(ISNUMBER(AO52) * (AO52<>0), AO52*'B. Lijsten'!$L$3),\nIF(ISNUMBER(AP52) * (AP52<>0), AP52*'B. Lijsten'!$L$4),\nIF(ISNUMBER(AS52) * (AS52<>0), AS52)\n)","v":0},1,0,0,{"$f":"IF(Invoeren!$G$15=\"Ja\",1,0)","v":0},null,null,{"$f":"IF(Invoeren!$G$19=\"Ja\",1,0)","v":0},null,{"$f":"IF(Invoeren!$G$23=\"Ja\",1,0)","v":0},null,null,null,{"$f":"IF(AND(AL52=0,Invoeren!$G$28=\"Ja\"),0,1)","v":1},"",{"$f":"IF('C. Warmtetechnieken'!L51=\"Individueel\",1,\nIF('C. Warmtetechnieken'!L51=\"Klein\",\"2 tot 200\",\nIF('C. Warmtetechnieken'!L51=\"Middel\",\"200 tot 500\",\nIF('C. Warmtetechnieken'!L51=\"Middelgroot\",\"500 tot 1500\",\nIF('C. Warmtetechnieken'!L51=\"Groot\",\"1500 tot 5000\",\nIF('C. Warmtetechnieken'!L51=\"Zeer groot\",\"Meer dan 5000\",\n\"\"))))))","v":"200 tot 500"},3,{"$f":"IF(Invoeren!$G$32=1,1,\nIF(Invoeren!$G$32=\"2 tot 200\",2,\nIF(Invoeren!$G$32=\"200 tot 500\",3,\nIF(Invoeren!$G$32=\"500 tot 1500\",4,\nIF(Invoeren!$G$32=\"1500 tot 5000\",5,\nIF(Invoeren!$G$32=\"Meer dan 5000\",6,\n\"\"))))))","v":""},{"$f":"IF(Invoeren!$G$34=\"Ja\",1,0)","v":0},{"$f":"IF(Invoeren!$G$35=1,1,\nIF(Invoeren!$G$35=\"2 tot 200\",2,\nIF(Invoeren!$G$35=\"200 tot 500\",3,\nIF(Invoeren!$G$35=\"500 tot 1500\",4,\nIF(Invoeren!$G$35=\"1500 tot 5000\",5,\nIF(Invoeren!$G$35=\"Meer dan 5000\",6,\n\"\"))))))","v":""},0,null,{"$f":"IF(Invoeren!$G$20=\"\",\"\",IF(Invoeren!$G$29=\"\",\"Geen restwarmtebron\",INDEX('B. Lijsten'!$C$44:$G$46, MATCH(Invoeren!$G$20, 'B. Lijsten'!$C$44:$C$46, 0), MATCH($AE52, 'B. Lijsten'!$D$43:$G$43, 0) + 1)))","v":""},{"$f":"IF(Invoeren!$G$27=\"\",\"\",INDEX('B. Lijsten'!$C$17:$F$18, MATCH(Invoeren!$G$27, 'B. Lijsten'!$C$17:$C$18, 0), MATCH('A. Breakdown'!$C52, 'B. Lijsten'!$D$16:$F$16, 0) + 1))","v":""},{"$f":"IF('C. Warmtetechnieken'!O51=\"Nee\",1,0)","v":1},{"$f":"IF(Invoeren!$G$29=\"\",\"\",INDEX('B. Lijsten'!$C$25:$E$26, MATCH(Invoeren!$G$29, 'B. Lijsten'!$C$25:$C$26, 0), MATCH('A. Breakdown'!$AH52, 'B. Lijsten'!$D$24:$E$24, 0) + 1))","v":""},{"$f":"IF('C. Warmtetechnieken'!P51=\"Nee\",1,0)","v":0},{"$f":"IF(W52=0,\"\",IF(Invoeren!$G$28=\"\",\"\",INDEX('B. Lijsten'!$C$21:$E$22,MATCH(Invoeren!$G$28,'B. Lijsten'!$C$21:$C$22,0),MATCH('A. Breakdown'!$AJ52,'B. Lijsten'!$D$20:$E$20,0)+1)))","v":""},1,{"$f":"IF(Invoeren!$G$12=\"\",\"\",INDEX('B. Lijsten'!$C$38:$F$42, MATCH(Invoeren!$G$12, 'B. Lijsten'!$C$38:$C$42, 0), MATCH('A. Breakdown'!$C52, 'B. Lijsten'!$D$37:$F$37, 0) + 1))","v":""},{"$f":"'C. Warmtetechnieken'!G51","v":"MT"},{"$f":"IF(Invoeren!$G$8=\"\",\"\",INDEX('B. Lijsten'!$C$28:$G$30,MATCH(Invoeren!$G$8,'B. Lijsten'!$C$28:$C$30,0),MATCH($AN52,'B. Lijsten'!$D$27:$G$27,0)+1))","v":""},{"$f":"IF(Invoeren!$G$9=\"\",\"\",INDEX('B. Lijsten'!$C$32:$G$36,MATCH(Invoeren!$G$9,'B. Lijsten'!$C$32:$C$36,0),MATCH($AN52,'B. Lijsten'!$D$31:$G$31,0)+1))","v":""},null,{"$f":"VLOOKUP(D52,Table1[[Warmtebron & type net]:[Energiearmoede verergerd?]],16,FALSE)","v":"Middelgrote dorpen en/of compacte wijken"},{"$f":"IF(Invoeren!$G$33=\"\",\"\",INDEX('B. Lijsten'!$C$48:$H$51,MATCH(Invoeren!$G$33,'B. Lijsten'!$C$48:$C$51,0),MATCH($AR52,'B. Lijsten'!$D$47:$H$47,0)+1))","v":""}]
[51,{"$f":"'C. Warmtetechnieken'!A52","v":"Thermische energie uit afvalwater - RWZI (TEA)​ MT + WKO"},{"$f":"'C. Warmtetechnieken'!B52","v":"Warmtenet"},"Warmtenet - Thermische energie uit afvalwater - RWZI (TEA)​ MT + WKO","Een MT-warmtenet op basis van afvalwater aquathermie (TEA) uit de RWZI, inclusief WKO","Afvalwater aquathermie (TEA)","Een MT-warmtenet op basis van afvalwater aquathermie (TEA) uit de RWZI, inclusief WKO",null,null,{"$f":"AVERAGE(\nIF(ISNUMBER(AG53) * (AG53<>0), AG53*'B. Lijsten'!$L$9),\nIF(ISNUMBER(AI53) * (AI53<>0), AI53*'B. Lijsten'!$L$11),\nIF(ISNUMBER(AK53) * (AK53<>0), AK53*'B. Lijsten'!$L$10),\nIF(ISNUMBER(AM53) * (AM53<>0), AM53*'B. Lijsten'!$L$5),\nIF(ISNUMBER(AO53) * (AO53<>0), AO53*'B. Lijsten'!$L$3),\nIF(ISNUMBER(AP53) * (AP53<>0), AP53*'B. Lijsten'!$L$4),\nIF(ISNUMBER(AS53) * (AS53<>0), AS53)\n)","v":0},1,0,0,{"$f":"IF(Invoeren!$G$15=\"Ja\",1,0)","v":0},null,null,{"$f":"IF(Invoeren!$G$19=\"Ja\",1,0)","v":0},null,{"$f":"IF(Invoeren!$G$23=\"Ja\",1,0)","v":0},null,null,null,{"$f":"IF(AND(AL53=0,Invoeren!$G$28=\"Ja\"),0,1)","v":1},"",{"$f":"IF('C. Warmtetechnieken'!L52=\"Individueel\",1,\nIF('C. Warmtetechnieken'!L52=\"Klein\",\"2 tot 200\",\nIF('C. Warmtetechnieken'!L52=\"Middel\",\"200 tot 500\",\nIF('C. Warmtetechnieken'!L52=\"Middelgroot\",\"500 tot 1500\",\nIF('C. Warmtetechnieken'!L52=\"Groot\",\"1500 tot 5000\",\nIF('C. Warmtetechnieken'!L52=\"Zeer groot\",\"Meer dan 5000\",\n\"\"))))))","v":"200 tot 500"},3,{"$f":"IF(Invoeren!$G$32=1,1,\nIF(Invoeren!$G$32=\"2 tot 200\",2,\nIF(Invoeren!$G$32=\"200 tot 500\",3,\nIF(Invoeren!$G$32=\"500 tot 1500\",4,\nIF(Invoeren!$G$32=\"1500 tot 5000\",5,\nIF(Invoeren!$G$32=\"Meer dan 5000\",6,\n\"\"))))))","v":""},{"$f":"IF(Invoeren!$G$34=\"Ja\",1,0)","v":0},{"$f":"IF(Invoeren!$G$35=1,1,\nIF(Invoeren!$G$35=\"2 tot 200\",2,\nIF(Invoeren!$G$35=\"200 tot 500\",3,\nIF(Invoeren!$G$35=\"500 tot 1500\",4,\nIF(Invoeren!$G$35=\"1500 tot 5000\",5,\nIF(Invoeren!$G$35=\"Meer dan 5000\",6,\n\"\"))))))","v":""},0,null,{"$f":"IF(Invoeren!$G$20=\"\",\"\",IF(Invoeren!$G$29=\"\",\"Geen restwarmtebron\",INDEX('B. Lijsten'!$C$44:$G$46, MATCH(Invoeren!$G$20, 'B. Lijsten'!$C$44:$C$46, 0), MATCH($AE53, 'B. Lijsten'!$D$43:$G$43, 0) + 1)))","v":""},{"$f":"IF(Invoeren!$G$27=\"\",\"\",INDEX('B. Lijsten'!$C$17:$F$18, MATCH(Invoeren!$G$27, 'B. Lijsten'!$C$17:$C$18, 0), MATCH('A. Breakdown'!$C53, 'B. Lijsten'!$D$16:$F$16, 0) + 1))","v":""},{"$f":"IF('C. Warmtetechnieken'!O52=\"Nee\",1,0)","v":1},{"$f":"IF(Invoeren!$G$29=\"\",\"\",INDEX('B. Lijsten'!$C$25:$E$26, MATCH(Invoeren!$G$29, 'B. Lijsten'!$C$25:$C$26, 0), MATCH('A. Breakdown'!$AH53, 'B. Lijsten'!$D$24:$E$24, 0) + 1))","v":""},{"$f":"IF('C. Warmtetechnieken'!P52=\"Nee\",1,0)","v":0},{"$f":"IF(W53=0,\"\",IF(Invoeren!$G$28=\"\",\"\",INDEX('B. Lijsten'!$C$21:$E$22,MATCH(Invoeren!$G$28,'B. Lijsten'!$C$21:$C$22,0),MATCH('A. Breakdown'!$AJ53,'B. Lijsten'!$D$20:$E$20,0)+1)))","v":""},0,{"$f":"IF(Invoeren!$G$12=\"\",\"\",INDEX('B. Lijsten'!$C$38:$F$42, MATCH(Invoeren!$G$12, 'B. Lijsten'!$C$38:$C$42, 0), MATCH('A. Breakdown'!$C53, 'B. Lijsten'!$D$37:$F$37, 0) + 1))","v":""},{"$f":"'C. Warmtetechnieken'!G52","v":"MT"},{"$f":"IF(Invoeren!$G$8=\"\",\"\",INDEX('B. Lijsten'!$C$28:$G$30,MATCH(Invoeren!$G$8,'B. Lijsten'!$C$28:$C$30,0),MATCH($AN53,'B. Lijsten'!$D$27:$G$27,0)+1))","v":""},{"$f":"IF(Invoeren!$G$9=\"\",\"\",INDEX('B. Lijsten'!$C$32:$G$36,MATCH(Invoeren!$G$9,'B. Lijsten'!$C$32:$C$36,0),MATCH($AN53,'B. Lijsten'!$D$31:$G$31,0)+1))","v":""},null,{"$f":"VLOOKUP(D53,Table1[[Warmtebron & type net]:[Energiearmoede verergerd?]],16,FALSE)","v":"Middelgrote dorpen en/of compacte wijken"},{"$f":"IF(Invoeren!$G$33=\"\",\"\",INDEX('B. Lijsten'!$C$48:$H$51,MATCH(Invoeren!$G$33,'B. Lijsten'!$C$48:$C$51,0),MATCH($AR53,'B. Lijsten'!$D$47:$H$47,0)+1))","v":""}]
[52,{"$f":"'C. Warmtetechnieken'!A53","v":"Thermische energie uit drinkwater (TED)​ MT"},{"$f":"'C. Warmtetechnieken'!B53","v":"Warmtenet"},"Warmtenet - Thermische energie uit drinkwater (TED)​ MT","Een MT-warmtenet op basis van drinkwater aquathermie (TED)","Drinkwater aquathermie (TED)","Een MT-warmtenet op basis van drinkwater aquathermie (TED)",null,null,{"$f":"AVERAGE(\nIF(ISNUMBER(AG54) * (AG54<>0), AG54*'B. Lijsten'!$L$9),\nIF(ISNUMBER(AI54) * (AI54<>0), AI54*'B. Lijsten'!$L$11),\nIF(ISNUMBER(AK54) * (AK54<>0), AK54*'B. Lijsten'!$L$10),\nIF(ISNUMBER(AM54) * (AM54<>0), AM54*'B. Lijsten'!$L$5),\nIF(ISNUMBER(AO54) * (AO54<>0), AO54*'B. Lijsten'!$L$3),\nIF(ISNUMBER(AP54) * (AP54<>0), AP54*'B. Lijsten'!$L$4),\nIF(ISNUMBER(AS54) * (AS54<>0), AS54)\n)","v":0},1,0,0,{"$f":"IF(Invoeren!$G$15=\"Ja\",1,0)","v":0},null,null,{"$f":"IF(Invoeren!$G$19=\"Ja\",1,0)","v":0},null,null,{"$f":"IF(Invoeren!$G$24=\"Ja\",1,0)","v":0},null,null,{"$f":"IF(AND(AL54=0,Invoeren!$G$28=\"Ja\"),0,1)","v":1},"",{"$f":"IF('C. Warmtetechnieken'!L53=\"Individueel\",1,\nIF('C. Warmtetechnieken'!L53=\"Klein\",\"2 tot 200\",\nIF('C. Warmtetechnieken'!L53=\"Middel\",\"200 tot 500\",\nIF('C. Warmtetechnieken'!L53=\"Middelgroot\",\"500 tot 1500\",\nIF('C. Warmtetechnieken'!L53=\"Groot\",\"1500 tot 5000\",\nIF('C. Warmtetechnieken'!L53=\"Zeer groot\",\"Meer dan 5000\",\n\"\"))))))","v":"200 tot 500"},3,{"$f":"IF(Invoeren!$G$32=1,1,\nIF(Invoeren!$G$32=\"2 tot 200\",2,\nIF(Invoeren!$G$32=\"200 tot 500\",3,\nIF(Invoeren!$G$32=\"500 tot 1500\",4,\nIF(Invoeren!$G$32=\"1500 tot 5000\",5,\nIF(Invoeren!$G$32=\"Meer dan 5000\",6,\n\"\"))))))","v":""},{"$f":"IF(Invoeren!$G$34=\"Ja\",1,0)","v":0},{"$f":"IF(Invoeren!$G$35=1,1,\nIF(Invoeren!$G$35=\"2 tot 200\",2,\nIF(Invoeren!$G$35=\"200 tot 500\",3,\nIF(Invoeren!$G$35=\"500 tot 1500\",4,\nIF(Invoeren!$G$35=\"1500 tot 5000\",5,\nIF(Invoeren!$G$35=\"Meer dan 5000\",6,\n\"\"))))))","v":""},0,null,{"$f":"IF(Invoeren!$G$20=\"\",\"\",IF(Invoeren!$G$29=\"\",\"Geen restwarmtebron\",INDEX('B. Lijsten'!$C$44:$G$46, MATCH(Invoeren!$G$20, 'B. Lijsten'!$C$44:$C$46, 0), MATCH($AE54, 'B. Lijsten'!$D$43:$G$43, 0) + 1)))","v":""},{"$f":"IF(Invoeren!$G$27=\"\",\"\",INDEX('B. Lijsten'!$C$17:$F$18, MATCH(Invoeren!$G$27, 'B. Lijsten'!$C$17:$C$18, 0), MATCH('A. Breakdown'!$C54, 'B. Lijsten'!$D$16:$F$16, 0) + 1))","v":""},{"$f":"IF('C. Warmtetechnieken'!O53=\"Nee\",1,0)","v":1},{"$f":"IF(Invoeren!$G$29=\"\",\"\",INDEX('B. Lijsten'!$C$25:$E$26, MATCH(Invoeren!$G$29, 'B. Lijsten'!$C$25:$C$26, 0), MATCH('A. Breakdown'!$AH54, 'B. Lijsten'!$D$24:$E$24, 0) + 1))","v":""},{"$f":"IF('C. Warmtetechnieken'!P53=\"Nee\",1,0)","v":0},{"$f":"IF(W54=0,\"\",IF(Invoeren!$G$28=\"\",\"\",INDEX('B. Lijsten'!$C$21:$E$22,MATCH(Invoeren!$G$28,'B. Lijsten'!$C$21:$C$22,0),MATCH('A. Breakdown'!$AJ54,'B. Lijsten'!$D$20:$E$20,0)+1)))","v":""},0,{"$f":"IF(Invoeren!$G$12=\"\",\"\",INDEX('B. Lijsten'!$C$38:$F$42, MATCH(Invoeren!$G$12, 'B. Lijsten'!$C$38:$C$42, 0), MATCH('A. Breakdown'!$C54, 'B. Lijsten'!$D$37:$F$37, 0) + 1))","v":""},{"$f":"'C. Warmtetechnieken'!G53","v":"MT"},{"$f":"IF(Invoeren!$G$8=\"\",\"\",INDEX('B. Lijsten'!$C$28:$G$30,MATCH(Invoeren!$G$8,'B. Lijsten'!$C$28:$C$30,0),MATCH($AN54,'B. Lijsten'!$D$27:$G$27,0)+1))","v":""},{"$f":"IF(Invoeren!$G$9=\"\",\"\",INDEX('B. Lijsten'!$C$32:$G$36,MATCH(Invoeren!$G$9,'B. Lijsten'!$C$32:$C$36,0),MATCH($AN54,'B. Lijsten'!$D$31:$G$31,0)+1))","v":""},null,{"$f":"VLOOKUP(D54,Table1[[Warmtebron & type net]:[Energiearmoede verergerd?]],16,FALSE)","v":"Middelgrote dorpen en/of compacte wijken"},{"$f":"IF(Invoeren!$G$33=\"\",\"\",INDEX('B. Lijsten'!$C$48:$H$51,MATCH(Invoeren!$G$33,'B. Lijsten'!$C$48:$C$51,0),MATCH($AR54,'B. Lijsten'!$D$47:$H$47,0)+1))","v":""}]
[53,{"$f":"'C. Warmtetechnieken'!A54","v":"Thermische energie uit drinkwater (TED)​ MT + WKO"},{"$f":"'C. Warmtetechnieken'!B54","v":"Warmtenet"},"Warmtenet - Thermische energie uit drinkwater (TED)​ MT + WKO","Een MT-warmtenet op basis van drinkwater aquathermie (TED), inclusief WKO","Drinkwater aquathermie (TED)","Een MT-warmtenet op basis van drinkwater aquathermie (TED), inclusief WKO",null,null,{"$f":"AVERAGE(\nIF(ISNUMBER(AG55) * (AG55<>0), AG55*'B. Lijsten'!$L$9),\nIF(ISNUMBER(AI55) * (AI55<>0), AI55*'B. Lijsten'!$L$11),\nIF(ISNUMBER(AK55) * (AK55<>0), AK55*'B. Lijsten'!$L$10),\nIF(ISNUMBER(AM55) * (AM55<>0), AM55*'B. Lijsten'!$L$5),\nIF(ISNUMBER(AO55) * (AO55<>0), AO55*'B. Lijsten'!$L$3),\nIF(ISNUMBER(AP55) * (AP55<>0), AP55*'B. Lijsten'!$L$4),\nIF(ISNUMBER(AS55) * (AS55<>0), AS55)\n)","v":0},0.8,0,0,{"$f":"IF(Invoeren!$G$15=\"Ja\",1,0)","v":0},null,null,{"$f":"IF(Invoeren!$G$19=\"Ja\",1,0)","v":0},null,null,{"$f":"IF(Invoeren!$G$24=\"Ja\",1,0)","v":0},null,null,{"$f":"IF(AND(AL55=0,Invoeren!$G$28=\"Ja\"),0,1)","v":1},"",{"$f":"IF('C. Warmtetechnieken'!L54=\"Individueel\",1,\nIF('C. Warmtetechnieken'!L54=\"Klein\",\"2 tot 200\",\nIF('C. Warmtetechnieken'!L54=\"Middel\",\"200 tot 500\",\nIF('C. Warmtetechnieken'!L54=\"Middelgroot\",\"500 tot 1500\",\nIF('C. Warmtetechnieken'!L54=\"Groot\",\"1500 tot 5000\",\nIF('C. Warmtetechnieken'!L54=\"Zeer groot\",\"Meer dan 5000\",\n\"\"))))))","v":"200 tot 500"},3,{"$f":"IF(Invoeren!$G$32=1,1,\nIF(Invoeren!$G$32=\"2 tot 200\",2,\nIF(Invoeren!$G$32=\"200 tot 500\",3,\nIF(Invoeren!$G$32=\"500 tot 1500\",4,\nIF(Invoeren!$G$32=\"1500 tot 5000\",5,\nIF(Invoeren!$G$32=\"Meer dan 5000\",6,\n\"\"))))))","v":""},{"$f":"IF(Invoeren!$G$34=\"Ja\",1,0)","v":0},{"$f":"IF(Invoeren!$G$35=1,1,\nIF(Invoeren!$G$35=\"2 tot 200\",2,\nIF(Invoeren!$G$35=\"200 tot 500\",3,\nIF(Invoeren!$G$35=\"500 tot 1500\",4,\nIF(Invoeren!$G$35=\"1500 tot 5000\",5,\nIF(Invoeren!$G$35=\"Meer dan 5000\",6,\n\"\"))))))","v":""},0,null,{"$f":"IF(Invoeren!$G$20=\"\",\"\",IF(Invoeren!$G$29=\"\",\"Geen restwarmtebron\",INDEX('B. Lijsten'!$C$44:$G$46, MATCH(Invoeren!$G$20, 'B. Lijsten'!$C$44:$C$46, 0), MATCH($AE55, 'B. Lijsten'!$D$43:$G$43, 0) + 1)))","v":""},{"$f":"IF(Invoeren!$G$27=\"\",\"\",INDEX('B. Lijsten'!$C$17:$F$18, MATCH(Invoeren!$G$27, 'B. Lijsten'!$C$17:$C$18, 0), MATCH('A. Breakdown'!$C55, 'B. Lijsten'!$D$16:$F$16, 0) + 1))","v":""},{"$f":"IF('C. Warmtetechnieken'!O54=\"Nee\",1,0)","v":1},{"$f":"IF(Invoeren!$G$29=\"\",\"\",INDEX('B. Lijsten'!$C$25:$E$26, MATCH(Invoeren!$G$29, 'B. Lijsten'!$C$25:$C$26, 0), MATCH('A. Breakdown'!$AH55, 'B. Lijsten'!$D$24:$E$24, 0) + 1))","v":""},{"$f":"IF('C. Warmtetechnieken'!P54=\"Nee\",1,0)","v":0},{"$f":"IF(W55=0,\"\",IF(Invoeren!$G$28=\"\",\"\",INDEX('B. Lijsten'!$C$21:$E$22,MATCH(Invoeren!$G$28,'B. Lijsten'!$C$21:$C$22,0),MATCH('A. Breakdown'!$AJ55,'B. Lijsten'!$D$20:$E$20,0)+1)))","v":""},0,{"$f":"IF(Invoeren!$G$12=\"\",\"\",INDEX('B. Lijsten'!$C$38:$F$42, MATCH(Invoeren!$G$12, 'B. Lijsten'!$C$38:$C$42, 0), MATCH('A. Breakdown'!$C55, 'B. Lijsten'!$D$37:$F$37, 0) + 1))","v":""},{"$f":"'C. Warmtetechnieken'!G54","v":"MT"},{"$f":"IF(Invoeren!$G$8=\"\",\"\",INDEX('B. Lijsten'!$C$28:$G$30,MATCH(Invoeren!$G$8,'B. Lijsten'!$C$28:$C$30,0),MATCH($AN55,'B. Lijsten'!$D$27:$G$27,0)+1))","v":""},{"$f":"IF(Invoeren!$G$9=\"\",\"\",INDEX('B. Lijsten'!$C$32:$G$36,MATCH(Invoeren!$G$9,'B. Lijsten'!$C$32:$C$36,0),MATCH($AN55,'B. Lijsten'!$D$31:$G$31,0)+1))","v":""},null,{"$f":"VLOOKUP(D55,Table1[[Warmtebron & type net]:[Energiearmoede verergerd?]],16,FALSE)","v":"Middelgrote dorpen en/of compacte wijken"},{"$f":"IF(Invoeren!$G$33=\"\",\"\",INDEX('B. Lijsten'!$C$48:$H$51,MATCH(Invoeren!$G$33,'B. Lijsten'!$C$48:$C$51,0),MATCH($AR55,'B. Lijsten'!$D$47:$H$47,0)+1))","v":""}]
[54,{"$f":"'C. Warmtetechnieken'!A55","v":"Thermische energie uit oppervlaktewater (TEO)​ MT"},{"$f":"'C. Warmtetechnieken'!B55","v":"Warmtenet"},"Warmtenet - Thermische energie uit oppervlaktewater (TEO)​ MT","Een MT-warmtenet op basis van oppervlaktewater aquathermie (TEO)","Oppervlaktewater aquathermie (TEO)","Een MT-warmtenet op basis van oppervlaktewater aquathermie (TEO)",null,null,{"$f":"AVERAGE(\nIF(ISNUMBER(AG56) * (AG56<>0), AG56*'B. Lijsten'!$L$9),\nIF(ISNUMBER(AI56) * (AI56<>0), AI56*'B. Lijsten'!$L$11),\nIF(ISNUMBER(AK56) * (AK56<>0), AK56*'B. Lijsten'!$L$10),\nIF(ISNUMBER(AM56) * (AM56<>0), AM56*'B. Lijsten'!$L$5),\nIF(ISNUMBER(AO56) * (AO56<>0), AO56*'B. Lijsten'!$L$3),\nIF(ISNUMBER(AP56) * (AP56<>0), AP56*'B. Lijsten'!$L$4),\nIF(ISNUMBER(AS56) * (AS56<>0), AS56)\n)","v":0},1,0,0,{"$f":"IF(Invoeren!$G$15=\"Ja\",1,0)","v":0},null,null,{"$f":"IF(Invoeren!$G$19=\"Ja\",1,0)","v":0},{"$f":"IF(Invoeren!$G$22=\"Ja\",1,0)","v":0},null,null,null,null,{"$f":"IF(AND(AL56=0,Invoeren!$G$28=\"Ja\"),0,1)","v":1},"",{"$f":"IF('C. Warmtetechnieken'!L55=\"Individueel\",1,\nIF('C. Warmtetechnieken'!L55=\"Klein\",\"2 tot 200\",\nIF('C. Warmtetechnieken'!L55=\"Middel\",\"200 tot 500\",\nIF('C. Warmtetechnieken'!L55=\"Middelgroot\",\"500 tot 1500\",\nIF('C. Warmtetechnieken'!L55=\"Groot\",\"1500 tot 5000\",\nIF('C. Warmtetechnieken'!L55=\"Zeer groot\",\"Meer dan 5000\",\n\"\"))))))","v":"200 tot 500"},3,{"$f":"IF(Invoeren!$G$32=1,1,\nIF(Invoeren!$G$32=\"2 tot 200\",2,\nIF(Invoeren!$G$32=\"200 tot 500\",3,\nIF(Invoeren!$G$32=\"500 tot 1500\",4,\nIF(Invoeren!$G$32=\"1500 tot 5000\",5,\nIF(Invoeren!$G$32=\"Meer dan 5000\",6,\n\"\"))))))","v":""},{"$f":"IF(Invoeren!$G$34=\"Ja\",1,0)","v":0},{"$f":"IF(Invoeren!$G$35=1,1,\nIF(Invoeren!$G$35=\"2 tot 200\",2,\nIF(Invoeren!$G$35=\"200 tot 500\",3,\nIF(Invoeren!$G$35=\"500 tot 1500\",4,\nIF(Invoeren!$G$35=\"1500 tot 5000\",5,\nIF(Invoeren!$G$35=\"Meer dan 5000\",6,\n\"\"))))))","v":""},0,null,{"$f":"IF(Invoeren!$G$20=\"\",\"\",IF(Invoeren!$G$29=\"\",\"Geen restwarmtebron\",INDEX('B. Lijsten'!$C$44:$G$46, MATCH(Invoeren!$G$20, 'B. Lijsten'!$C$44:$C$46, 0), MATCH($AE56, 'B. Lijsten'!$D$43:$G$43, 0) + 1)))","v":""},{"$f":"IF(Invoeren!$G$27=\"\",\"\",INDEX('B. Lijsten'!$C$17:$F$18, MATCH(Invoeren!$G$27, 'B. Lijsten'!$C$17:$C$18, 0), MATCH('A. Breakdown'!$C56, 'B. Lijsten'!$D$16:$F$16, 0) + 1))","v":""},{"$f":"IF('C. Warmtetechnieken'!O55=\"Nee\",1,0)","v":1},{"$f":"IF(Invoeren!$G$29=\"\",\"\",INDEX('B. Lijsten'!$C$25:$E$26, MATCH(Invoeren!$G$29, 'B. Lijsten'!$C$25:$C$26, 0), MATCH('A. Breakdown'!$AH56, 'B. Lijsten'!$D$24:$E$24, 0) + 1))","v":""},{"$f":"IF('C. Warmtetechnieken'!P55=\"Nee\",1,0)","v":0},{"$f":"IF(W56=0,\"\",IF(Invoeren!$G$28=\"\",\"\",INDEX('B. Lijsten'!$C$21:$E$22,MATCH(Invoeren!$G$28,'B. Lijsten'!$C$21:$C$22,0),MATCH('A. Breakdown'!$AJ56,'B. Lijsten'!$D$20:$E$20,0)+1)))","v":""},0,{"$f":"IF(Invoeren!$G$12=\"\",\"\",INDEX('B. Lijsten'!$C$38:$F$42, MATCH(Invoeren!$G$12, 'B. Lijsten'!$C$38:$C$42, 0), MATCH('A. Breakdown'!$C56, 'B. Lijsten'!$D$37:$F$37, 0) + 1))","v":""},{"$f":"'C. Warmtetechnieken'!G55","v":"MT"},{"$f":"IF(Invoeren!$G$8=\"\",\"\",INDEX('B. Lijsten'!$C$28:$G$30,MATCH(Invoeren!$G$8,'B. Lijsten'!$C$28:$C$30,0),MATCH($AN56,'B. Lijsten'!$D$27:$G$27,0)+1))","v":""},{"$f":"IF(Invoeren!$G$9=\"\",\"\",INDEX('B. Lijsten'!$C$32:$G$36,MATCH(Invoeren!$G$9,'B. Lijsten'!$C$32:$C$36,0),MATCH($AN56,'B. Lijsten'!$D$31:$G$31,0)+1))","v":""},null,{"$f":"VLOOKUP(D56,Table1[[Warmtebron & type net]:[Energiearmoede verergerd?]],16,FALSE)","v":"Middelgrote dorpen en/of compacte wijken"},{"$f":"IF(Invoeren!$G$33=\"\",\"\",INDEX('B. Lijsten'!$C$48:$H$51,MATCH(Invoeren!$G$33,'B. Lijsten'!$C$48:$C$51,0),MATCH($AR56,'B. Lijsten'!$D$47:$H$47,0)+1))","v":""}]
[55,{"$f":"'C. Warmtetechnieken'!A56","v":"Thermische energie uit oppervlaktewater (TEO)​ MT + WKO"},{"$f":"'C. Warmtetechnieken'!B56","v":"Warmtenet"},"Warmtenet - Thermische energie uit oppervlaktewater (TEO)​ MT + WKO","Een MT-warmtenet op basis van Oppervlaktewater aquathermie (TEO), inclusief WKO","Oppervlaktewater aquathermie (TEO)","Een MT-warmtenet op basis van Oppervlaktewater aquathermie (TEO), inclusief WKO",null,null,{"$f":"AVERAGE(\nIF(ISNUMBER(AG57) * (AG57<>0), AG57*'B. Lijsten'!$L$9),\nIF(ISNUMBER(AI57) * (AI57<>0), AI57*'B. Lijsten'!$L$11),\nIF(ISNUMBER(AK57) * (AK57<>0), AK57*'B. Lijsten'!$L$10),\nIF(ISNUMBER(AM57) * (AM57<>0), AM57*'B. Lijsten'!$L$5),\nIF(ISNUMBER(AO57) * (AO57<>0), AO57*'B. Lijsten'!$L$3),\nIF(ISNUMBER(AP57) * (AP57<>0), AP57*'B. Lijsten'!$L$4),\nIF(ISNUMBER(AS57) * (AS57<>0), AS57)\n)","v":0},1,0,0,{"$f":"IF(Invoeren!$G$15=\"Ja\",1,0)","v":0},null,null,{"$f":"IF(Invoeren!$G$19=\"Ja\",1,0)","v":0},{"$f":"IF(Invoeren!$G$22=\"Ja\",1,0)","v":0},null,null,null,null,{"$f":"IF(AND(AL57=0,Invoeren!$G$28=\"Ja\"),0,1)","v":1},"",{"$f":"IF('C. Warmtetechnieken'!L56=\"Individueel\",1,\nIF('C. Warmtetechnieken'!L56=\"Klein\",\"2 tot 200\",\nIF('C. Warmtetechnieken'!L56=\"Middel\",\"200 tot 500\",\nIF('C. Warmtetechnieken'!L56=\"Middelgroot\",\"500 tot 1500\",\nIF('C. Warmtetechnieken'!L56=\"Groot\",\"1500 tot 5000\",\nIF('C. Warmtetechnieken'!L56=\"Zeer groot\",\"Meer dan 5000\",\n\"\"))))))","v":"200 tot 500"},3,{"$f":"IF(Invoeren!$G$32=1,1,\nIF(Invoeren!$G$32=\"2 tot 200\",2,\nIF(Invoeren!$G$32=\"200 tot 500\",3,\nIF(Invoeren!$G$32=\"500 tot 1500\",4,\nIF(Invoeren!$G$32=\"1500 tot 5000\",5,\nIF(Invoeren!$G$32=\"Meer dan 5000\",6,\n\"\"))))))","v":""},{"$f":"IF(Invoeren!$G$34=\"Ja\",1,0)","v":0},{"$f":"IF(Invoeren!$G$35=1,1,\nIF(Invoeren!$G$35=\"2 tot 200\",2,\nIF(Invoeren!$G$35=\"200 tot 500\",3,\nIF(Invoeren!$G$35=\"500 tot 1500\",4,\nIF(Invoeren!$G$35=\"1500 tot 5000\",5,\nIF(Invoeren!$G$35=\"Meer dan 5000\",6,\n\"\"))))))","v":""},0,null,{"$f":"IF(Invoeren!$G$20=\"\",\"\",IF(Invoeren!$G$29=\"\",\"Geen restwarmtebron\",INDEX('B. Lijsten'!$C$44:$G$46, MATCH(Invoeren!$G$20, 'B. Lijsten'!$C$44:$C$46, 0), MATCH($AE57, 'B. Lijsten'!$D$43:$G$43, 0) + 1)))","v":""},{"$f":"IF(Invoeren!$G$27=\"\",\"\",INDEX('B. Lijsten'!$C$17:$F$18, MATCH(Invoeren!$G$27, 'B. Lijsten'!$C$17:$C$18, 0), MATCH('A. Breakdown'!$C57, 'B. Lijsten'!$D$16:$F$16, 0) + 1))","v":""},{"$f":"IF('C. Warmtetechnieken'!O56=\"Nee\",1,0)","v":1},{"$f":"IF(Invoeren!$G$29=\"\",\"\",INDEX('B. Lijsten'!$C$25:$E$26, MATCH(Invoeren!$G$29, 'B. Lijsten'!$C$25:$C$26, 0), MATCH('A. Breakdown'!$AH57, 'B. Lijsten'!$D$24:$E$24, 0) + 1))","v":""},{"$f":"IF('C. Warmtetechnieken'!P56=\"Nee\",1,0)","v":0},{"$f":"IF(W57=0,\"\",IF(Invoeren!$G$28=\"\",\"\",INDEX('B. Lijsten'!$C$21:$E$22,MATCH(Invoeren!$G$28,'B. Lijsten'!$C$21:$C$22,0),MATCH('A. Breakdown'!$AJ57,'B. Lijsten'!$D$20:$E$20,0)+1)))","v":""},0,{"$f":"IF(Invoeren!$G$12=\"\",\"\",INDEX('B. Lijsten'!$C$38:$F$42, MATCH(Invoeren!$G$12, 'B. Lijsten'!$C$38:$C$42, 0), MATCH('A. Breakdown'!$C57, 'B. Lijsten'!$D$37:$F$37, 0) + 1))","v":""},{"$f":"'C. Warmtetechnieken'!G56","v":"MT"},{"$f":"IF(Invoeren!$G$8=\"\",\"\",INDEX('B. Lijsten'!$C$28:$G$30,MATCH(Invoeren!$G$8,'B. Lijsten'!$C$28:$C$30,0),MATCH($AN57,'B. Lijsten'!$D$27:$G$27,0)+1))","v":""},{"$f":"IF(Invoeren!$G$9=\"\",\"\",INDEX('B. Lijsten'!$C$32:$G$36,MATCH(Invoeren!$G$9,'B. Lijsten'!$C$32:$C$36,0),MATCH($AN57,'B. Lijsten'!$D$31:$G$31,0)+1))","v":""},null,{"$f":"VLOOKUP(D57,Table1[[Warmtebron & type net]:[Energiearmoede verergerd?]],16,FALSE)","v":"Middelgrote dorpen en/of compacte wijken"},{"$f":"IF(Invoeren!$G$33=\"\",\"\",INDEX('B. Lijsten'!$C$48:$H$51,MATCH(Invoeren!$G$33,'B. Lijsten'!$C$48:$C$51,0),MATCH($AR57,'B. Lijsten'!$D$47:$H$47,0)+1))","v":""}]
[56,{"$f":"'C. Warmtetechnieken'!A57","v":"Collectieve lucht-water warmtepomp"},{"$f":"'C. Warmtetechnieken'!B57","v":"Warmtenet"},"Warmtenet - Collectieve lucht-water warmtepomp","Een MT-warmtenet op basis van een collectieve lucht-water warmtepomp","Buitenlucht","Een MT-warmtenet op basis van een collectieve lucht-water warmtepomp",null,null,{"$f":"AVERAGE(\nIF(ISNUMBER(AG58) * (AG58<>0), AG58*'B. Lijsten'!$L$9),\nIF(ISNUMBER(AI58) * (AI58<>0), AI58*'B. Lijsten'!$L$11),\nIF(ISNUMBER(AK58) * (AK58<>0), AK58*'B. Lijsten'!$L$10),\nIF(ISNUMBER(AM58) * (AM58<>0), AM58*'B. Lijsten'!$L$5),\nIF(ISNUMBER(AO58) * (AO58<>0), AO58*'B. Lijsten'!$L$3),\nIF(ISNUMBER(AP58) * (AP58<>0), AP58*'B. Lijsten'!$L$4),\nIF(ISNUMBER(AS58) * (AS58<>0), AS58)\n)","v":0},1,0,0,null,null,null,null,null,null,null,null,1,{"$f":"IF(AND(AL58=0,Invoeren!$G$28=\"Ja\"),0,1)","v":1},"",{"$f":"IF('C. Warmtetechnieken'!L57=\"Individueel\",1,\nIF('C. Warmtetechnieken'!L57=\"Klein\",\"2 tot 200\",\nIF('C. Warmtetechnieken'!L57=\"Middel\",\"200 tot 500\",\nIF('C. Warmtetechnieken'!L57=\"Middelgroot\",\"500 tot 1500\",\nIF('C. Warmtetechnieken'!L57=\"Groot\",\"1500 tot 5000\",\nIF('C. Warmtetechnieken'!L57=\"Zeer groot\",\"Meer dan 5000\",\n\"\"))))))","v":"200 tot 500"},3,{"$f":"IF(Invoeren!$G$32=1,1,\nIF(Invoeren!$G$32=\"2 tot 200\",2,\nIF(Invoeren!$G$32=\"200 tot 500\",3,\nIF(Invoeren!$G$32=\"500 tot 1500\",4,\nIF(Invoeren!$G$32=\"1500 tot 5000\",5,\nIF(Invoeren!$G$32=\"Meer dan 5000\",6,\n\"\"))))))","v":""},{"$f":"IF(Invoeren!$G$34=\"Ja\",1,0)","v":0},{"$f":"IF(Invoeren!$G$35=1,1,\nIF(Invoeren!$G$35=\"2 tot 200\",2,\nIF(Invoeren!$G$35=\"200 tot 500\",3,\nIF(Invoeren!$G$35=\"500 tot 1500\",4,\nIF(Invoeren!$G$35=\"1500 tot 5000\",5,\nIF(Invoeren!$G$35=\"Meer dan 5000\",6,\n\"\"))))))","v":""},0,null,{"$f":"IF(Invoeren!$G$20=\"\",\"\",IF(Invoeren!$G$29=\"\",\"Geen restwarmtebron\",INDEX('B. Lijsten'!$C$44:$G$46, MATCH(Invoeren!$G$20, 'B. Lijsten'!$C$44:$C$46, 0), MATCH($AE58, 'B. Lijsten'!$D$43:$G$43, 0) + 1)))","v":""},{"$f":"IF(Invoeren!$G$27=\"\",\"\",INDEX('B. Lijsten'!$C$17:$F$18, MATCH(Invoeren!$G$27, 'B. Lijsten'!$C$17:$C$18, 0), MATCH('A. Breakdown'!$C58, 'B. Lijsten'!$D$16:$F$16, 0) + 1))","v":""},{"$f":"IF('C. Warmtetechnieken'!O57=\"Nee\",1,0)","v":1},{"$f":"IF(Invoeren!$G$29=\"\",\"\",INDEX('B. Lijsten'!$C$25:$E$26, MATCH(Invoeren!$G$29, 'B. Lijsten'!$C$25:$C$26, 0), MATCH('A. Breakdown'!$AH58, 'B. Lijsten'!$D$24:$E$24, 0) + 1))","v":""},{"$f":"IF('C. Warmtetechnieken'!P57=\"Nee\",1,0)","v":0},{"$f":"IF(W58=0,\"\",IF(Invoeren!$G$28=\"\",\"\",INDEX('B. Lijsten'!$C$21:$E$22,MATCH(Invoeren!$G$28,'B. Lijsten'!$C$21:$C$22,0),MATCH('A. Breakdown'!$AJ58,'B. Lijsten'!$D$20:$E$20,0)+1)))","v":""},1,{"$f":"IF(Invoeren!$G$12=\"\",\"\",INDEX('B. Lijsten'!$C$38:$F$42, MATCH(Invoeren!$G$12, 'B. Lijsten'!$C$38:$C$42, 0), MATCH('A. Breakdown'!$C58, 'B. Lijsten'!$D$37:$F$37, 0) + 1))","v":""},{"$f":"'C. Warmtetechnieken'!G57","v":"MT"},{"$f":"IF(Invoeren!$G$8=\"\",\"\",INDEX('B. Lijsten'!$C$28:$G$30,MATCH(Invoeren!$G$8,'B. Lijsten'!$C$28:$C$30,0),MATCH($AN58,'B. Lijsten'!$D$27:$G$27,0)+1))","v":""},{"$f":"IF(Invoeren!$G$9=\"\",\"\",INDEX('B. Lijsten'!$C$32:$G$36,MATCH(Invoeren!$G$9,'B. Lijsten'!$C$32:$C$36,0),MATCH($AN58,'B. Lijsten'!$D$31:$G$31,0)+1))","v":""},null,{"$f":"VLOOKUP(D58,Table1[[Warmtebron & type net]:[Energiearmoede verergerd?]],16,FALSE)","v":"Middelgrote dorpen en/of compacte wijken"},{"$f":"IF(Invoeren!$G$33=\"\",\"\",INDEX('B. Lijsten'!$C$48:$H$51,MATCH(Invoeren!$G$33,'B. Lijsten'!$C$48:$C$51,0),MATCH($AR58,'B. Lijsten'!$D$47:$H$47,0)+1))","v":""}]
[57,{"$f":"'C. Warmtetechnieken'!A58","v":"Collectieve warmtepomp - Hybride"},{"$f":"'C. Warmtetechnieken'!B58","v":"Warmtenet"},"Warmtenet - Collectieve warmtepomp - Hybride","Een MT-warmtenet op basis van een collectieve hybride warmtepomp","Hybride warmtepomp","Een MT-warmtenet op basis van een collectieve hybride warmtepomp",null,null,{"$f":"AVERAGE(\nIF(ISNUMBER(AG59) * (AG59<>0), AG59*'B. Lijsten'!$L$9),\nIF(ISNUMBER(AI59) * (AI59<>0), AI59*'B. Lijsten'!$L$11),\nIF(ISNUMBER(AK59) * (AK59<>0), AK59*'B. Lijsten'!$L$10),\nIF(ISNUMBER(AM59) * (AM59<>0), AM59*'B. Lijsten'!$L$5),\nIF(ISNUMBER(AO59) * (AO59<>0), AO59*'B. Lijsten'!$L$3),\nIF(ISNUMBER(AP59) * (AP59<>0), AP59*'B. Lijsten'!$L$4),\nIF(ISNUMBER(AS59) * (AS59<>0), AS59)\n)","v":0},1,0,0,null,null,null,null,null,null,null,null,1,{"$f":"IF(AND(AL59=0,Invoeren!$G$28=\"Ja\"),0,1)","v":1},"",{"$f":"IF('C. Warmtetechnieken'!L58=\"Individueel\",1,\nIF('C. Warmtetechnieken'!L58=\"Klein\",\"2 tot 200\",\nIF('C. Warmtetechnieken'!L58=\"Middel\",\"200 tot 500\",\nIF('C. Warmtetechnieken'!L58=\"Middelgroot\",\"500 tot 1500\",\nIF('C. Warmtetechnieken'!L58=\"Groot\",\"1500 tot 5000\",\nIF('C. Warmtetechnieken'!L58=\"Zeer groot\",\"Meer dan 5000\",\n\"\"))))))","v":"200 tot 500"},3,{"$f":"IF(Invoeren!$G$32=1,1,\nIF(Invoeren!$G$32=\"2 tot 200\",2,\nIF(Invoeren!$G$32=\"200 tot 500\",3,\nIF(Invoeren!$G$32=\"500 tot 1500\",4,\nIF(Invoeren!$G$32=\"1500 tot 5000\",5,\nIF(Invoeren!$G$32=\"Meer dan 5000\",6,\n\"\"))))))","v":""},{"$f":"IF(Invoeren!$G$34=\"Ja\",1,0)","v":0},{"$f":"IF(Invoeren!$G$35=1,1,\nIF(Invoeren!$G$35=\"2 tot 200\",2,\nIF(Invoeren!$G$35=\"200 tot 500\",3,\nIF(Invoeren!$G$35=\"500 tot 1500\",4,\nIF(Invoeren!$G$35=\"1500 tot 5000\",5,\nIF(Invoeren!$G$35=\"Meer dan 5000\",6,\n\"\"))))))","v":""},0,null,{"$f":"IF(Invoeren!$G$20=\"\",\"\",IF(Invoeren!$G$29=\"\",\"Geen restwarmtebron\",INDEX('B. Lijsten'!$C$44:$G$46, MATCH(Invoeren!$G$20, 'B. Lijsten'!$C$44:$C$46, 0), MATCH($AE59, 'B. Lijsten'!$D$43:$G$43, 0) + 1)))","v":""},{"$f":"IF(Invoeren!$G$27=\"\",\"\",INDEX('B. Lijsten'!$C$17:$F$18, MATCH(Invoeren!$G$27, 'B. Lijsten'!$C$17:$C$18, 0), MATCH('A. Breakdown'!$C59, 'B. Lijsten'!$D$16:$F$16, 0) + 1))","v":""},{"$f":"IF('C. Warmtetechnieken'!O58=\"Nee\",1,0)","v":1},{"$f":"IF(Invoeren!$G$29=\"\",\"\",INDEX('B. Lijsten'!$C$25:$E$26, MATCH(Invoeren!$G$29, 'B. Lijsten'!$C$25:$C$26, 0), MATCH('A. Breakdown'!$AH59, 'B. Lijsten'!$D$24:$E$24, 0) + 1))","v":""},{"$f":"IF('C. Warmtetechnieken'!P58=\"Nee\",1,0)","v":1},{"$f":"IF(W59=0,\"\",IF(Invoeren!$G$28=\"\",\"\",INDEX('B. Lijsten'!$C$21:$E$22,MATCH(Invoeren!$G$28,'B. Lijsten'!$C$21:$C$22,0),MATCH('A. Breakdown'!$AJ59,'B. Lijsten'!$D$20:$E$20,0)+1)))","v":""},1,{"$f":"IF(Invoeren!$G$12=\"\",\"\",INDEX('B. Lijsten'!$C$38:$F$42, MATCH(Invoeren!$G$12, 'B. Lijsten'!$C$38:$C$42, 0), MATCH('A. Breakdown'!$C59, 'B. Lijsten'!$D$37:$F$37, 0) + 1))","v":""},{"$f":"'C. Warmtetechnieken'!G58","v":"MT"},{"$f":"IF(Invoeren!$G$8=\"\",\"\",INDEX('B. Lijsten'!$C$28:$G$30,MATCH(Invoeren!$G$8,'B. Lijsten'!$C$28:$C$30,0),MATCH($AN59,'B. Lijsten'!$D$27:$G$27,0)+1))","v":""},{"$f":"IF(Invoeren!$G$9=\"\",\"\",INDEX('B. Lijsten'!$C$32:$G$36,MATCH(Invoeren!$G$9,'B. Lijsten'!$C$32:$C$36,0),MATCH($AN59,'B. Lijsten'!$D$31:$G$31,0)+1))","v":""},null,{"$f":"VLOOKUP(D59,Table1[[Warmtebron & type net]:[Energiearmoede verergerd?]],16,FALSE)","v":"Middelgrote dorpen en/of compacte wijken"},{"$f":"IF(Invoeren!$G$33=\"\",\"\",INDEX('B. Lijsten'!$C$48:$H$51,MATCH(Invoeren!$G$33,'B. Lijsten'!$C$48:$C$51,0),MATCH($AR59,'B. Lijsten'!$D$47:$H$47,0)+1))","v":""}]
[58,{"$f":"'C. Warmtetechnieken'!A59","v":"Bodem-water warmtepomp"},{"$f":"'C. Warmtetechnieken'!B59","v":"Individueel"},{"$f":"C60&\" - \"&B60","v":"Individueel - Bodem-water warmtepomp"},"Individuele bodem-waterwarmtepompen","Bodem-water warmtepomp","Individuele bodem-waterwarmtepompen",null,null,{"$f":"AVERAGE(\nIF(ISNUMBER(AG60) * (AG60<>0), AG60*'B. Lijsten'!$L$9),\nIF(ISNUMBER(AI60) * (AI60<>0), AI60*'B. Lijsten'!$L$11),\nIF(ISNUMBER(AK60) * (AK60<>0), AK60*'B. Lijsten'!$L$10),\nIF(ISNUMBER(AM60) * (AM60<>0), AM60*'B. Lijsten'!$L$5),\nIF(ISNUMBER(AO60) * (AO60<>0), AO60*'B. Lijsten'!$L$3),\nIF(ISNUMBER(AP60) * (AP60<>0), AP60*'B. Lijsten'!$L$4),\nIF(ISNUMBER(AS60) * (AS60<>0), AS60)\n)","v":0},1,0,0,null,null,null,null,null,null,null,null,1,{"$f":"IF(AND(AL60=0,Invoeren!$G$28=\"Ja\"),0,1)","v":1},"",{"$f":"IF('C. Warmtetechnieken'!L59=\"Individueel\",1,\nIF('C. Warmtetechnieken'!L59=\"Klein\",\"2 tot 200\",\nIF('C. Warmtetechnieken'!L59=\"Middel\",\"200 tot 500\",\nIF('C. Warmtetechnieken'!L59=\"Middelgroot\",\"500 tot 1500\",\nIF('C. Warmtetechnieken'!L59=\"Groot\",\"1500 tot 5000\",\nIF('C. Warmtetechnieken'!L59=\"Zeer groot\",\"Meer dan 5000\",\n\"\"))))))","v":1},1,{"$f":"IF(Invoeren!$G$32=1,1,\nIF(Invoeren!$G$32=\"2 tot 200\",2,\nIF(Invoeren!$G$32=\"200 tot 500\",3,\nIF(Invoeren!$G$32=\"500 tot 1500\",4,\nIF(Invoeren!$G$32=\"1500 tot 5000\",5,\nIF(Invoeren!$G$32=\"Meer dan 5000\",6,\n\"\"))))))","v":""},{"$f":"IF(Invoeren!$G$34=\"Ja\",1,0)","v":0},{"$f":"IF(Invoeren!$G$35=1,1,\nIF(Invoeren!$G$35=\"2 tot 200\",2,\nIF(Invoeren!$G$35=\"200 tot 500\",3,\nIF(Invoeren!$G$35=\"500 tot 1500\",4,\nIF(Invoeren!$G$35=\"1500 tot 5000\",5,\nIF(Invoeren!$G$35=\"Meer dan 5000\",6,\n\"\"))))))","v":""},0,null,{"$f":"IF(Invoeren!$G$20=\"\",\"\",IF(Invoeren!$G$29=\"\",\"Geen restwarmtebron\",INDEX('B. Lijsten'!$C$44:$G$46, MATCH(Invoeren!$G$20, 'B. Lijsten'!$C$44:$C$46, 0), MATCH($AE60, 'B. Lijsten'!$D$43:$G$43, 0) + 1)))","v":""},{"$f":"IF(Invoeren!$G$27=\"\",\"\",INDEX('B. Lijsten'!$C$17:$F$18, MATCH(Invoeren!$G$27, 'B. Lijsten'!$C$17:$C$18, 0), MATCH('A. Breakdown'!$C60, 'B. Lijsten'!$D$16:$F$16, 0) + 1))","v":""},{"$f":"IF('C. Warmtetechnieken'!O59=\"Nee\",1,0)","v":1},{"$f":"IF(Invoeren!$G$29=\"\",\"\",INDEX('B. Lijsten'!$C$25:$E$26, MATCH(Invoeren!$G$29, 'B. Lijsten'!$C$25:$C$26, 0), MATCH('A. Breakdown'!$AH60, 'B. Lijsten'!$D$24:$E$24, 0) + 1))","v":""},{"$f":"IF('C. Warmtetechnieken'!P59=\"Nee\",1,0)","v":0},{"$f":"IF(W60=0,\"\",IF(Invoeren!$G$28=\"\",\"\",INDEX('B. Lijsten'!$C$21:$E$22,MATCH(Invoeren!$G$28,'B. Lijsten'!$C$21:$C$22,0),MATCH('A. Breakdown'!$AJ60,'B. Lijsten'!$D$20:$E$20,0)+1)))","v":""},0,{"$f":"IF(Invoeren!$G$12=\"\",\"\",INDEX('B. Lijsten'!$C$38:$F$42, MATCH(Invoeren!$G$12, 'B. Lijsten'!$C$38:$C$42, 0), MATCH('A. Breakdown'!$C60, 'B. Lijsten'!$D$37:$F$37, 0) + 1))","v":""},{"$f":"'C. Warmtetechnieken'!G59","v":"ZLT"},{"$f":"IF(Invoeren!$G$8=\"\",\"\",INDEX('B. Lijsten'!$C$28:$G$30,MATCH(Invoeren!$G$8,'B. Lijsten'!$C$28:$C$30,0),MATCH($AN60,'B. Lijsten'!$D$27:$G$27,0)+1))","v":""},{"$f":"IF(Invoeren!$G$9=\"\",\"\",INDEX('B. Lijsten'!$C$32:$G$36,MATCH(Invoeren!$G$9,'B. Lijsten'!$C$32:$C$36,0),MATCH($AN60,'B. Lijsten'!$D$31:$G$31,0)+1))","v":""},null,{"$f":"VLOOKUP(D60,Table1[[Warmtebron & type net]:[Energiearmoede verergerd?]],16,FALSE)","v":"Verspreide bebouwing en/of landelijke dorpen"},{"$f":"IF(Invoeren!$G$33=\"\",\"\",INDEX('B. Lijsten'!$C$48:$H$51,MATCH(Invoeren!$G$33,'B. Lijsten'!$C$48:$C$51,0),MATCH($AR60,'B. Lijsten'!$D$47:$H$47,0)+1))","v":""}]
[59,{"$f":"'C. Warmtetechnieken'!A60","v":"Gesloten bodemenergie​"},{"$f":"'C. Warmtetechnieken'!B60","v":"Individueel"},"Individueel - Gesloten bodemenergie​","Individuele gesloten bodemenergie systemen/bodemlus (WKO)","Gesloten bodemenergie","Individuele gesloten bodemenergie systemen/bodemlus (WKO)",null,null,{"$f":"AVERAGE(\nIF(ISNUMBER(AG61) * (AG61<>0), AG61*'B. Lijsten'!$L$9),\nIF(ISNUMBER(AI61) * (AI61<>0), AI61*'B. Lijsten'!$L$11),\nIF(ISNUMBER(AK61) * (AK61<>0), AK61*'B. Lijsten'!$L$10),\nIF(ISNUMBER(AM61) * (AM61<>0), AM61*'B. Lijsten'!$L$5),\nIF(ISNUMBER(AO61) * (AO61<>0), AO61*'B. Lijsten'!$L$3),\nIF(ISNUMBER(AP61) * (AP61<>0), AP61*'B. Lijsten'!$L$4),\nIF(ISNUMBER(AS61) * (AS61<>0), AS61)\n)","v":0},1,0,0,null,null,null,null,null,null,null,null,1,{"$f":"IF(AND(AL61=0,Invoeren!$G$28=\"Ja\"),0,1)","v":1},"",{"$f":"IF('C. Warmtetechnieken'!L60=\"Individueel\",1,\nIF('C. Warmtetechnieken'!L60=\"Klein\",\"2 tot 200\",\nIF('C. Warmtetechnieken'!L60=\"Middel\",\"200 tot 500\",\nIF('C. Warmtetechnieken'!L60=\"Middelgroot\",\"500 tot 1500\",\nIF('C. Warmtetechnieken'!L60=\"Groot\",\"1500 tot 5000\",\nIF('C. Warmtetechnieken'!L60=\"Zeer groot\",\"Meer dan 5000\",\n\"\"))))))","v":1},1,{"$f":"IF(Invoeren!$G$32=1,1,\nIF(Invoeren!$G$32=\"2 tot 200\",2,\nIF(Invoeren!$G$32=\"200 tot 500\",3,\nIF(Invoeren!$G$32=\"500 tot 1500\",4,\nIF(Invoeren!$G$32=\"1500 tot 5000\",5,\nIF(Invoeren!$G$32=\"Meer dan 5000\",6,\n\"\"))))))","v":""},{"$f":"IF(Invoeren!$G$34=\"Ja\",1,0)","v":0},{"$f":"IF(Invoeren!$G$35=1,1,\nIF(Invoeren!$G$35=\"2 tot 200\",2,\nIF(Invoeren!$G$35=\"200 tot 500\",3,\nIF(Invoeren!$G$35=\"500 tot 1500\",4,\nIF(Invoeren!$G$35=\"1500 tot 5000\",5,\nIF(Invoeren!$G$35=\"Meer dan 5000\",6,\n\"\"))))))","v":""},0,null,{"$f":"IF(Invoeren!$G$20=\"\",\"\",IF(Invoeren!$G$29=\"\",\"Geen restwarmtebron\",INDEX('B. Lijsten'!$C$44:$G$46, MATCH(Invoeren!$G$20, 'B. Lijsten'!$C$44:$C$46, 0), MATCH($AE61, 'B. Lijsten'!$D$43:$G$43, 0) + 1)))","v":""},{"$f":"IF(Invoeren!$G$27=\"\",\"\",INDEX('B. Lijsten'!$C$17:$F$18, MATCH(Invoeren!$G$27, 'B. Lijsten'!$C$17:$C$18, 0), MATCH('A. Breakdown'!$C61, 'B. Lijsten'!$D$16:$F$16, 0) + 1))","v":""},{"$f":"IF('C. Warmtetechnieken'!O60=\"Nee\",1,0)","v":1},{"$f":"IF(Invoeren!$G$29=\"\",\"\",INDEX('B. Lijsten'!$C$25:$E$26, MATCH(Invoeren!$G$29, 'B. Lijsten'!$C$25:$C$26, 0), MATCH('A. Breakdown'!$AH61, 'B. Lijsten'!$D$24:$E$24, 0) + 1))","v":""},{"$f":"IF('C. Warmtetechnieken'!P60=\"Nee\",1,0)","v":0},{"$f":"IF(W61=0,\"\",IF(Invoeren!$G$28=\"\",\"\",INDEX('B. Lijsten'!$C$21:$E$22,MATCH(Invoeren!$G$28,'B. Lijsten'!$C$21:$C$22,0),MATCH('A. Breakdown'!$AJ61,'B. Lijsten'!$D$20:$E$20,0)+1)))","v":""},0,{"$f":"IF(Invoeren!$G$12=\"\",\"\",INDEX('B. Lijsten'!$C$38:$F$42, MATCH(Invoeren!$G$12, 'B. Lijsten'!$C$38:$C$42, 0), MATCH('A. Breakdown'!$C61, 'B. Lijsten'!$D$37:$F$37, 0) + 1))","v":""},{"$f":"'C. Warmtetechnieken'!G60","v":"LT"},{"$f":"IF(Invoeren!$G$8=\"\",\"\",INDEX('B. Lijsten'!$C$28:$G$30,MATCH(Invoeren!$G$8,'B. Lijsten'!$C$28:$C$30,0),MATCH($AN61,'B. Lijsten'!$D$27:$G$27,0)+1))","v":""},{"$f":"IF(Invoeren!$G$9=\"\",\"\",INDEX('B. Lijsten'!$C$32:$G$36,MATCH(Invoeren!$G$9,'B. Lijsten'!$C$32:$C$36,0),MATCH($AN61,'B. Lijsten'!$D$31:$G$31,0)+1))","v":""},null,{"$f":"VLOOKUP(D61,Table1[[Warmtebron & type net]:[Energiearmoede verergerd?]],16,FALSE)","v":"Verspreide bebouwing en/of landelijke dorpen"},{"$f":"IF(Invoeren!$G$33=\"\",\"\",INDEX('B. Lijsten'!$C$48:$H$51,MATCH(Invoeren!$G$33,'B. Lijsten'!$C$48:$C$51,0),MATCH($AR61,'B. Lijsten'!$D$47:$H$47,0)+1))","v":""}]
[60,{"$f":"'C. Warmtetechnieken'!A61","v":"Open bodemenergie"},{"$f":"'C. Warmtetechnieken'!B61","v":"Individueel"},"Individueel - Open bodemenergie","Individuele open bodemenergie systemen (WKO)","Open bodemenergie","Individuele open bodemenergie systemen (WKO)",null,null,{"$f":"AVERAGE(\nIF(ISNUMBER(AG62) * (AG62<>0), AG62*'B. Lijsten'!$L$9),\nIF(ISNUMBER(AI62) * (AI62<>0), AI62*'B. Lijsten'!$L$11),\nIF(ISNUMBER(AK62) * (AK62<>0), AK62*'B. Lijsten'!$L$10),\nIF(ISNUMBER(AM62) * (AM62<>0), AM62*'B. Lijsten'!$L$5),\nIF(ISNUMBER(AO62) * (AO62<>0), AO62*'B. Lijsten'!$L$3),\nIF(ISNUMBER(AP62) * (AP62<>0), AP62*'B. Lijsten'!$L$4),\nIF(ISNUMBER(AS62) * (AS62<>0), AS62)\n)","v":0},1,0,0,null,null,null,null,null,null,null,null,1,{"$f":"IF(AND(AL62=0,Invoeren!$G$28=\"Ja\"),0,1)","v":1},"",{"$f":"IF('C. Warmtetechnieken'!L61=\"Individueel\",1,\nIF('C. Warmtetechnieken'!L61=\"Klein\",\"2 tot 200\",\nIF('C. Warmtetechnieken'!L61=\"Middel\",\"200 tot 500\",\nIF('C. Warmtetechnieken'!L61=\"Middelgroot\",\"500 tot 1500\",\nIF('C. Warmtetechnieken'!L61=\"Groot\",\"1500 tot 5000\",\nIF('C. Warmtetechnieken'!L61=\"Zeer groot\",\"Meer dan 5000\",\n\"\"))))))","v":1},1,{"$f":"IF(Invoeren!$G$32=1,1,\nIF(Invoeren!$G$32=\"2 tot 200\",2,\nIF(Invoeren!$G$32=\"200 tot 500\",3,\nIF(Invoeren!$G$32=\"500 tot 1500\",4,\nIF(Invoeren!$G$32=\"1500 tot 5000\",5,\nIF(Invoeren!$G$32=\"Meer dan 5000\",6,\n\"\"))))))","v":""},{"$f":"IF(Invoeren!$G$34=\"Ja\",1,0)","v":0},{"$f":"IF(Invoeren!$G$35=1,1,\nIF(Invoeren!$G$35=\"2 tot 200\",2,\nIF(Invoeren!$G$35=\"200 tot 500\",3,\nIF(Invoeren!$G$35=\"500 tot 1500\",4,\nIF(Invoeren!$G$35=\"1500 tot 5000\",5,\nIF(Invoeren!$G$35=\"Meer dan 5000\",6,\n\"\"))))))","v":""},0,null,{"$f":"IF(Invoeren!$G$20=\"\",\"\",IF(Invoeren!$G$29=\"\",\"Geen restwarmtebron\",INDEX('B. Lijsten'!$C$44:$G$46, MATCH(Invoeren!$G$20, 'B. Lijsten'!$C$44:$C$46, 0), MATCH($AE62, 'B. Lijsten'!$D$43:$G$43, 0) + 1)))","v":""},{"$f":"IF(Invoeren!$G$27=\"\",\"\",INDEX('B. Lijsten'!$C$17:$F$18, MATCH(Invoeren!$G$27, 'B. Lijsten'!$C$17:$C$18, 0), MATCH('A. Breakdown'!$C62, 'B. Lijsten'!$D$16:$F$16, 0) + 1))","v":""},{"$f":"IF('C. Warmtetechnieken'!O61=\"Nee\",1,0)","v":1},{"$f":"IF(Invoeren!$G$29=\"\",\"\",INDEX('B. Lijsten'!$C$25:$E$26, MATCH(Invoeren!$G$29, 'B. Lijsten'!$C$25:$C$26, 0), MATCH('A. Breakdown'!$AH62, 'B. Lijsten'!$D$24:$E$24, 0) + 1))","v":""},{"$f":"IF('C. Warmtetechnieken'!P61=\"Nee\",1,0)","v":0},{"$f":"IF(W62=0,\"\",IF(Invoeren!$G$28=\"\",\"\",INDEX('B. Lijsten'!$C$21:$E$22,MATCH(Invoeren!$G$28,'B. Lijsten'!$C$21:$C$22,0),MATCH('A. Breakdown'!$AJ62,'B. Lijsten'!$D$20:$E$20,0)+1)))","v":""},0,{"$f":"IF(Invoeren!$G$12=\"\",\"\",INDEX('B. Lijsten'!$C$38:$F$42, MATCH(Invoeren!$G$12, 'B. Lijsten'!$C$38:$C$42, 0), MATCH('A. Breakdown'!$C62, 'B. Lijsten'!$D$37:$F$37, 0) + 1))","v":""},{"$f":"'C. Warmtetechnieken'!G61","v":"ZLT"},{"$f":"IF(Invoeren!$G$8=\"\",\"\",INDEX('B. Lijsten'!$C$28:$G$30,MATCH(Invoeren!$G$8,'B. Lijsten'!$C$28:$C$30,0),MATCH($AN62,'B. Lijsten'!$D$27:$G$27,0)+1))","v":""},{"$f":"IF(Invoeren!$G$9=\"\",\"\",INDEX('B. Lijsten'!$C$32:$G$36,MATCH(Invoeren!$G$9,'B. Lijsten'!$C$32:$C$36,0),MATCH($AN62,'B. Lijsten'!$D$31:$G$31,0)+1))","v":""},null,{"$f":"VLOOKUP(D62,Table1[[Warmtebron & type net]:[Energiearmoede verergerd?]],16,FALSE)","v":"Verspreide bebouwing en/of landelijke dorpen"},{"$f":"IF(Invoeren!$G$33=\"\",\"\",INDEX('B. Lijsten'!$C$48:$H$51,MATCH(Invoeren!$G$33,'B. Lijsten'!$C$48:$C$51,0),MATCH($AR62,'B. Lijsten'!$D$47:$H$47,0)+1))","v":""}]
[61,{"$f":"'C. Warmtetechnieken'!A62","v":"PVT"},{"$f":"'C. Warmtetechnieken'!B62","v":"Bronnet"},"Bronnet - PVT","Een bronnet op basis van PVT-zonnepanelen","Zonnepanelen","Een bronnet op basis van PVT-zonnepanelen",null,null,{"$f":"AVERAGE(\nIF(ISNUMBER(AG63) * (AG63<>0), AG63*'B. Lijsten'!$L$9),\nIF(ISNUMBER(AI63) * (AI63<>0), AI63*'B. Lijsten'!$L$11),\nIF(ISNUMBER(AK63) * (AK63<>0), AK63*'B. Lijsten'!$L$10),\nIF(ISNUMBER(AM63) * (AM63<>0), AM63*'B. Lijsten'!$L$5),\nIF(ISNUMBER(AO63) * (AO63<>0), AO63*'B. Lijsten'!$L$3),\nIF(ISNUMBER(AP63) * (AP63<>0), AP63*'B. Lijsten'!$L$4),\nIF(ISNUMBER(AS63) * (AS63<>0), AS63)\n)","v":0},1,0,0,null,null,null,null,null,null,null,null,1,{"$f":"IF(AND(AL63=0,Invoeren!$G$28=\"Ja\"),0,1)","v":1},"",{"$f":"IF('C. Warmtetechnieken'!L62=\"Individueel\",1,\nIF('C. Warmtetechnieken'!L62=\"Klein\",\"2 tot 200\",\nIF('C. Warmtetechnieken'!L62=\"Middel\",\"200 tot 500\",\nIF('C. Warmtetechnieken'!L62=\"Middelgroot\",\"500 tot 1500\",\nIF('C. Warmtetechnieken'!L62=\"Groot\",\"1500 tot 5000\",\nIF('C. Warmtetechnieken'!L62=\"Zeer groot\",\"Meer dan 5000\",\n\"\"))))))","v":"2 tot 200"},2,{"$f":"IF(Invoeren!$G$32=1,1,\nIF(Invoeren!$G$32=\"2 tot 200\",2,\nIF(Invoeren!$G$32=\"200 tot 500\",3,\nIF(Invoeren!$G$32=\"500 tot 1500\",4,\nIF(Invoeren!$G$32=\"1500 tot 5000\",5,\nIF(Invoeren!$G$32=\"Meer dan 5000\",6,\n\"\"))))))","v":""},{"$f":"IF(Invoeren!$G$34=\"Ja\",1,0)","v":0},{"$f":"IF(Invoeren!$G$35=1,1,\nIF(Invoeren!$G$35=\"2 tot 200\",2,\nIF(Invoeren!$G$35=\"200 tot 500\",3,\nIF(Invoeren!$G$35=\"500 tot 1500\",4,\nIF(Invoeren!$G$35=\"1500 tot 5000\",5,\nIF(Invoeren!$G$35=\"Meer dan 5000\",6,\n\"\"))))))","v":""},0,null,{"$f":"IF(Invoeren!$G$20=\"\",\"\",IF(Invoeren!$G$29=\"\",\"Geen restwarmtebron\",INDEX('B. Lijsten'!$C$44:$G$46, MATCH(Invoeren!$G$20, 'B. Lijsten'!$C$44:$C$46, 0), MATCH($AE63, 'B. Lijsten'!$D$43:$G$43, 0) + 1)))","v":""},{"$f":"IF(Invoeren!$G$27=\"\",\"\",INDEX('B. Lijsten'!$C$17:$F$18, MATCH(Invoeren!$G$27, 'B. Lijsten'!$C$17:$C$18, 0), MATCH('A. Breakdown'!$C63, 'B. Lijsten'!$D$16:$F$16, 0) + 1))","v":""},{"$f":"IF('C. Warmtetechnieken'!O62=\"Nee\",1,0)","v":1},{"$f":"IF(Invoeren!$G$29=\"\",\"\",INDEX('B. Lijsten'!$C$25:$E$26, MATCH(Invoeren!$G$29, 'B. Lijsten'!$C$25:$C$26, 0), MATCH('A. Breakdown'!$AH63, 'B. Lijsten'!$D$24:$E$24, 0) + 1))","v":""},{"$f":"IF('C. Warmtetechnieken'!P62=\"Nee\",1,0)","v":1},{"$f":"IF(W63=0,\"\",IF(Invoeren!$G$28=\"\",\"\",INDEX('B. Lijsten'!$C$21:$E$22,MATCH(Invoeren!$G$28,'B. Lijsten'!$C$21:$C$22,0),MATCH('A. Breakdown'!$AJ63,'B. Lijsten'!$D$20:$E$20,0)+1)))","v":""},1,{"$f":"IF(Invoeren!$G$12=\"\",\"\",INDEX('B. Lijsten'!$C$38:$F$42, MATCH(Invoeren!$G$12, 'B. Lijsten'!$C$38:$C$42, 0), MATCH('A. Breakdown'!$C63, 'B. Lijsten'!$D$37:$F$37, 0) + 1))","v":""},{"$f":"'C. Warmtetechnieken'!G62","v":"LT"},{"$f":"IF(Invoeren!$G$8=\"\",\"\",INDEX('B. Lijsten'!$C$28:$G$30,MATCH(Invoeren!$G$8,'B. Lijsten'!$C$28:$C$30,0),MATCH($AN63,'B. Lijsten'!$D$27:$G$27,0)+1))","v":""},{"$f":"IF(Invoeren!$G$9=\"\",\"\",INDEX('B. Lijsten'!$C$32:$G$36,MATCH(Invoeren!$G$9,'B. Lijsten'!$C$32:$C$36,0),MATCH($AN63,'B. Lijsten'!$D$31:$G$31,0)+1))","v":""},null,{"$f":"VLOOKUP(D63,Table1[[Warmtebron & type net]:[Energiearmoede verergerd?]],16,FALSE)","v":"Verspreide bebouwing en/of landelijke dorpen"},{"$f":"IF(Invoeren!$G$33=\"\",\"\",INDEX('B. Lijsten'!$C$48:$H$51,MATCH(Invoeren!$G$33,'B. Lijsten'!$C$48:$C$51,0),MATCH($AR63,'B. Lijsten'!$D$47:$H$47,0)+1))","v":""}]
[62,{"$f":"'C. Warmtetechnieken'!A63","v":"PVT (WKO)"},{"$f":"'C. Warmtetechnieken'!B63","v":"Warmtenet"},"Warmtenet - PVT (WKO)","Een LT-warmtenet op basis van PVT-zonnepanelen, inclusief WKO","Zonnepanelen","Een LT-warmtenet op basis van PVT-zonnepanelen, inclusief WKO",null,null,{"$f":"AVERAGE(\nIF(ISNUMBER(AG64) * (AG64<>0), AG64*'B. Lijsten'!$L$9),\nIF(ISNUMBER(AI64) * (AI64<>0), AI64*'B. Lijsten'!$L$11),\nIF(ISNUMBER(AK64) * (AK64<>0), AK64*'B. Lijsten'!$L$10),\nIF(ISNUMBER(AM64) * (AM64<>0), AM64*'B. Lijsten'!$L$5),\nIF(ISNUMBER(AO64) * (AO64<>0), AO64*'B. Lijsten'!$L$3),\nIF(ISNUMBER(AP64) * (AP64<>0), AP64*'B. Lijsten'!$L$4),\nIF(ISNUMBER(AS64) * (AS64<>0), AS64)\n)","v":0},1,0,0,null,null,null,null,null,null,null,null,1,{"$f":"IF(AND(AL64=0,Invoeren!$G$28=\"Ja\"),0,1)","v":1},"",{"$f":"IF('C. Warmtetechnieken'!L63=\"Individueel\",1,\nIF('C. Warmtetechnieken'!L63=\"Klein\",\"2 tot 200\",\nIF('C. Warmtetechnieken'!L63=\"Middel\",\"200 tot 500\",\nIF('C. Warmtetechnieken'!L63=\"Middelgroot\",\"500 tot 1500\",\nIF('C. Warmtetechnieken'!L63=\"Groot\",\"1500 tot 5000\",\nIF('C. Warmtetechnieken'!L63=\"Zeer groot\",\"Meer dan 5000\",\n\"\"))))))","v":"200 tot 500"},3,{"$f":"IF(Invoeren!$G$32=1,1,\nIF(Invoeren!$G$32=\"2 tot 200\",2,\nIF(Invoeren!$G$32=\"200 tot 500\",3,\nIF(Invoeren!$G$32=\"500 tot 1500\",4,\nIF(Invoeren!$G$32=\"1500 tot 5000\",5,\nIF(Invoeren!$G$32=\"Meer dan 5000\",6,\n\"\"))))))","v":""},{"$f":"IF(Invoeren!$G$34=\"Ja\",1,0)","v":0},{"$f":"IF(Invoeren!$G$35=1,1,\nIF(Invoeren!$G$35=\"2 tot 200\",2,\nIF(Invoeren!$G$35=\"200 tot 500\",3,\nIF(Invoeren!$G$35=\"500 tot 1500\",4,\nIF(Invoeren!$G$35=\"1500 tot 5000\",5,\nIF(Invoeren!$G$35=\"Meer dan 5000\",6,\n\"\"))))))","v":""},0,null,{"$f":"IF(Invoeren!$G$20=\"\",\"\",IF(Invoeren!$G$29=\"\",\"Geen restwarmtebron\",INDEX('B. Lijsten'!$C$44:$G$46, MATCH(Invoeren!$G$20, 'B. Lijsten'!$C$44:$C$46, 0), MATCH($AE64, 'B. Lijsten'!$D$43:$G$43, 0) + 1)))","v":""},{"$f":"IF(Invoeren!$G$27=\"\",\"\",INDEX('B. Lijsten'!$C$17:$F$18, MATCH(Invoeren!$G$27, 'B. Lijsten'!$C$17:$C$18, 0), MATCH('A. Breakdown'!$C64, 'B. Lijsten'!$D$16:$F$16, 0) + 1))","v":""},{"$f":"IF('C. Warmtetechnieken'!O63=\"Nee\",1,0)","v":1},{"$f":"IF(Invoeren!$G$29=\"\",\"\",INDEX('B. Lijsten'!$C$25:$E$26, MATCH(Invoeren!$G$29, 'B. Lijsten'!$C$25:$C$26, 0), MATCH('A. Breakdown'!$AH64, 'B. Lijsten'!$D$24:$E$24, 0) + 1))","v":""},{"$f":"IF('C. Warmtetechnieken'!P63=\"Nee\",1,0)","v":0},{"$f":"IF(W64=0,\"\",IF(Invoeren!$G$28=\"\",\"\",INDEX('B. Lijsten'!$C$21:$E$22,MATCH(Invoeren!$G$28,'B. Lijsten'!$C$21:$C$22,0),MATCH('A. Breakdown'!$AJ64,'B. Lijsten'!$D$20:$E$20,0)+1)))","v":""},0,{"$f":"IF(Invoeren!$G$12=\"\",\"\",INDEX('B. Lijsten'!$C$38:$F$42, MATCH(Invoeren!$G$12, 'B. Lijsten'!$C$38:$C$42, 0), MATCH('A. Breakdown'!$C64, 'B. Lijsten'!$D$37:$F$37, 0) + 1))","v":""},{"$f":"'C. Warmtetechnieken'!G63","v":"LT"},{"$f":"IF(Invoeren!$G$8=\"\",\"\",INDEX('B. Lijsten'!$C$28:$G$30,MATCH(Invoeren!$G$8,'B. Lijsten'!$C$28:$C$30,0),MATCH($AN64,'B. Lijsten'!$D$27:$G$27,0)+1))","v":""},{"$f":"IF(Invoeren!$G$9=\"\",\"\",INDEX('B. Lijsten'!$C$32:$G$36,MATCH(Invoeren!$G$9,'B. Lijsten'!$C$32:$C$36,0),MATCH($AN64,'B. Lijsten'!$D$31:$G$31,0)+1))","v":""},null,{"$f":"VLOOKUP(D64,Table1[[Warmtebron & type net]:[Energiearmoede verergerd?]],16,FALSE)","v":"Verspreide bebouwing en/of landelijke dorpen"},{"$f":"IF(Invoeren!$G$33=\"\",\"\",INDEX('B. Lijsten'!$C$48:$H$51,MATCH(Invoeren!$G$33,'B. Lijsten'!$C$48:$C$51,0),MATCH($AR64,'B. Lijsten'!$D$47:$H$47,0)+1))","v":""}]

{"sheet":"B. Lijsten","index":6,"n_rows":51,"n_cols":12,"rows_kept":51,"cut":false,"hidden":true,"merged":[[0,3,0,9],[0,10,0,13],[15,1,17,1],[18,1,21,1],[22,1,25,1],[26,1,29,1],[30,1,35,1],[36,1,41,1],[42,1,45,1],[46,1,50,1]]}
["#","Vraag","Subvragen","Antwoordmogelijkheden",null,null,null,null,null,null,"Weegfactoren"]
["1a","Is het gemiddelde energielabel bekend van de kern?",null,"Ja","Nee"]
["1b ","Welk e-label is overwegend aanwezig",null,"A-B","B-C","D-G",null,null,null,null,"Energielabel",2]
["1c","Welk bouwjaar...",null,"2015 of nieuwer","2001 t/m 2014","1993 t/m 2000","1976 t/m 1992","Voor 1975",null,null,"Bouwjaar",2]
["2a ","Wat is de warmtevraagdichtheid",null,"Hoog","Middenhoog","Midden","Middenlaag","Laag",null,null,"Warmtevraagdichtheid",1]
["3a","Is er een warmtebron beschikbaar in de buurt van de kern","Geothermie; Restwarmte; Datathermie; Aquathermie","Ja","Nee","Test",null,null,null,null,"Restwarmtebron",1]
["3b","Indien Aqua ja: welk type?","TEO (oppervlaktewater); TEA (afvalwater);TED (Drinkwater)","Ja","Nee"]
["3c","Welke temperatuursrestwarmte is aanwezig",null,"Hoog","Midden","Laag"]
["4a","Is er sprake van netcongestie?",null,"Ja","Nee",null,null,null,null,null,"Netcongestie",2]
["4b","Bevindt de bron zich in waterwinningsgebied",null,"Ja","Nee",null,null,null,null,null,"Waterwinning",1]
["4c","Bevindt de bron zich in natura2000 gebied?",null,"Ja","Nee",null,null,null,null,null,"Natura 2000",1]
["5a","Hoeveel WEQ kunnen aangesloten worden?",null,1,"2 tot 200","200 tot 500","500 tot 1500","1500 tot 5000","Meer dan 5000"]
[null,null,null,"Individueel","Klein","Middel","Middelgroot","Groot","Zeer groot"]
["5b","Wat is de vorm van de kern",null,"Grote dorpen en/of stedelijke kernen","Middelgrote dorpen en/of compacte wijken","Kleine dorpen en/of compacte wijken","Verspreide bebouwing en/of landelijke dorpen"]
["5c","Zijn er andere kernen in de buurt?",null,"Ja","Nee"]
[null,"Netcongestie",null,"Warmtenet","Bronnet","Individueel"]
[null,null,"Ja",5,3,2]
[null,null,"Nee",5,5,4]
[null,"bevindt de bron zich in waterwinningsgebied",null,"Oplossingen met wwg","Oplossingen zonder afhankelijkheid wwg"]
[null,null,null,0,1]
[null,null,"Ja",2,5]
[null,null,"nee",5,5]
[null,"bevindt de bron zich in natura2000 gebied?",null,"Oplossingen met afhankelijkheid natura2000","Oplossingen zonder afhankelijkheid natura2000"]
[null,null,null,0,1]
[null,null,"Ja",2,5]
[null,null,"nee",5,5]
[null,"Welk e-label is overwegend aanwezig",null,"ZLT","LT","MT","HT"]
[null,null,"A-B",5,5,3,1]
[null,null,"B-C",2,3,5,3]
[null,null,"D-G",1,2,5,5]
[null,"Welk bouwjaar...",null,"ZLT","LT","MT","HT"]
[null,null,"2015 of nieuwer",5,5,2,1]
[null,null,"2001 t/m 2014",5,5,2,1]
[null,null,"1993 t/m 2000",4,4,4,3]
[null,null,"1976 t/m 1992",3,3,5,5]
[null,null,"Voor 1975",1,1,5,5]
[null,"Wat is de warmtevraagdichtheid",null,"Warmtenet","Bronnet","Individueel"]
[null,null,"Hoog",5,5,1]
[null,null,"Middenhoog",5,5,1]
[null,null,"Midden",4,4,2]
[null,null,"Middenlaag",3,3,3]
[null,null,"Laag",2,2,4]
[null,"Welke temperatuursrestwarmte is aanwezig",null,"ZLT","LT","MT","HT"]
[null,null,"Hoog",2,3,5,5]
[null,null,"Midden",3,4,5,5]
[null,null,"Laag",5,5,2,2]
[null,"Wat is de vorm van de kern",null,{"$f":"D14","v":"Grote dorpen en/of stedelijke kernen"},{"$f":"E14","v":"Middelgrote dorpen en/of compacte wijken"},"Kleine dorpen en/of compacte wijken","Verspreide bebouwing en/of landelijke dorpen","Maakt niet uit"]
[null,null,"Grote dorpen en/of stedelijke kernen",5,4,3,2,5]
[null,null,"Middelgrote dorpen en/of compacte wijken",3,5,4,3,5]
[null,null,"Kleine dorpen en/of compacte wijken",2,3,5,4,5]
[null,null,"Verspreide bebouwing en/of landelijke dorpen",1,2,3,5,5]

{"sheet":"C. Warmtetechnieken","index":7,"n_rows":63,"n_cols":20,"rows_kept":63,"cut":false,"hidden":true,"merged":[]}
["Warmtebron","Type net","Warmtebron & type net","Opwaardering","PBL startanalyse code","Bron temperatuur","Aflevertemperatuur","Uitkomst","Energielabel","Piekvoorziening nodig?","Dichtheid bebouwing: is er een ondergrens?","Schaalgrootte","Netcongestie score (1-6)","Nabijheid van bron (t.b.v. water, restwarmte)","Beperkingen omgeving Natura2000","Beperking omgeving waterwinning","Samenwerking?","Type kern","Type woning voorkeur","Energiearmoede verergerd?"]
["Datathermie","Bronnet",{"$f":"B2&\" - \"&A2","v":"Bronnet - Datathermie"},"Decentraal","S3a",25,"LT","Restwarmte van datacenters wordt via een bronnet en decentrale warmtepompen benut. Dit systeem werkt op LT-niveau (25-40°C), maakt gebruik van een decentraal warmtepomp en levert warmte via vloerverwarming of lage temperatuur radiatoren.",{"$f":"IF(Table1[[#This Row],[Aflevertemperatuur]]=\"ZLT\",\"A-B\",IF(Table1[[#This Row],[Aflevertemperatuur]]=\"LT\",\"A-C\",IF(Table1[[#This Row],[Aflevertemperatuur]]=\"MT\",\"A-D\",IF(Table1[[#This Row],[Aflevertemperatuur]]=\"HT\",\"Alles\",IF(Table1[[#This Row],[Aflevertemperatuur]]=\"LT/MT\",\"A-D\")))))","v":"A-C"},{"$f":"IF(Table1[[#This Row],[Opwaardering]]=\"Decentraal\",\"Nee\",IF(Table1[[#This Row],[Opwaardering]]=\"N.v.t.\",\"Nee\",\"Ja\"))","v":"Nee"},"Middelhoge dichtheid","Middel",2,"Ja","Nee","Nee",{"$f":"IF(Table1[[#This Row],[Schaalgrootte]]=\"Middel\",\"Lokaal mogelijk\",IF(Table1[[#This Row],[Schaalgrootte]]=\"Zeer groot\",\"Samenwerking noodzakelijk\",IF(Table1[[#This Row],[Schaalgrootte]]=\"Klein\",\"Lokaal mogelijk\",IF(Table1[[#This Row],[Schaalgrootte]]=\"Middelgroot\",\"Mogelijk samenwerking nodig\",IF(Table1[[#This Row],[Schaalgrootte]]=\"Individueel\",\"N.v.t.\",IF(Table1[[#This Row],[Schaalgrootte]]=\"Groot\",\"Mogelijk samenwerking nodig\",\"\"))))))","v":"Lokaal mogelijk"},"Grote dorpen en/of stedelijke kernen","Gestapelde bouw, rijwoningen in stedelijke gebieden",{"$f":"IF(Table1[[#This Row],[Type net]]=\"Individueel\",\"Ja\",\"Nee\")","v":"Nee"}]
["Datathermie LT","Warmtenet","Warmtenet - Datathermie LT","Centraal","N.v.t.",25,"LT","Restwarmte uit datacenters wordt centraal benut en via het warmtenet verspreid. Dit systeem werkt op LT/MT-niveau (25-75°C), maakt gebruik van een centrale warmtepomp en levert warmte via vloerverwarming, lage temperatuur radiatoren of convectoren.",{"$f":"IF(Table1[[#This Row],[Aflevertemperatuur]]=\"ZLT\",\"A-B\",IF(Table1[[#This Row],[Aflevertemperatuur]]=\"LT\",\"A-C\",IF(Table1[[#This Row],[Aflevertemperatuur]]=\"MT\",\"A-D\",IF(Table1[[#This Row],[Aflevertemperatuur]]=\"HT\",\"Alles\",IF(Table1[[#This Row],[Aflevertemperatuur]]=\"LT/MT\",\"A-D\")))))","v":"A-C"},{"$f":"IF(Table1[[#This Row],[Opwaardering]]=\"Decentraal\",\"Nee\",IF(Table1[[#This Row],[Opwaardering]]=\"N.v.t.\",\"Nee\",\"Ja\"))","v":"Ja"},"Middelhoge dichtheid","Middel",3,"Ja","Nee","Nee",{"$f":"IF(Table1[[#This Row],[Schaalgrootte]]=\"Middel\",\"Lokaal mogelijk\",IF(Table1[[#This Row],[Schaalgrootte]]=\"Zeer groot\",\"Samenwerking noodzakelijk\",IF(Table1[[#This Row],[Schaalgrootte]]=\"Klein\",\"Lokaal mogelijk\",IF(Table1[[#This Row],[Schaalgrootte]]=\"Middelgroot\",\"Mogelijk samenwerking nodig\",IF(Table1[[#This Row],[Schaalgrootte]]=\"Individueel\",\"N.v.t.\",IF(Table1[[#This Row],[Schaalgrootte]]=\"Groot\",\"Mogelijk samenwerking nodig\",\"\"))))))","v":"Lokaal mogelijk"},"Grote dorpen en/of stedelijke kernen","Gestapelde bouw, rijwoningen in stedelijke gebieden",{"$f":"IF(Table1[[#This Row],[Type net]]=\"Individueel\",\"Ja\",\"Nee\")","v":"Nee"}]
["Diepe geothermie​","Warmtenet","Warmtenet - Diepe geothermie​","Centraal","S2f",85,"HT","Hoge temperatuur warmte uit diepe geothermie wordt centraal opgewekt en via een warmtenet geleverd. Dit systeem werkt op HT-niveau (> 75°C), maakt gebruik van een centrale warmtepomp en levert warmte via hoge temperatuur radiatoren of bestaande afgiftesystemen.",{"$f":"IF(Table1[[#This Row],[Aflevertemperatuur]]=\"ZLT\",\"A-B\",IF(Table1[[#This Row],[Aflevertemperatuur]]=\"LT\",\"A-C\",IF(Table1[[#This Row],[Aflevertemperatuur]]=\"MT\",\"A-D\",IF(Table1[[#This Row],[Aflevertemperatuur]]=\"HT\",\"Alles\",IF(Table1[[#This Row],[Aflevertemperatuur]]=\"LT/MT\",\"A-D\")))))","v":"Alles"},{"$f":"IF(Table1[[#This Row],[Opwaardering]]=\"Decentraal\",\"Nee\",IF(Table1[[#This Row],[Opwaardering]]=\"N.v.t.\",\"Nee\",\"Ja\"))","v":"Ja"},"Hoge dichtheid","Zeer groot",3,"Ja","Nee","Ja",{"$f":"IF(Table1[[#This Row],[Schaalgrootte]]=\"Middel\",\"Lokaal mogelijk\",IF(Table1[[#This Row],[Schaalgrootte]]=\"Zeer groot\",\"Samenwerking noodzakelijk\",IF(Table1[[#This Row],[Schaalgrootte]]=\"Klein\",\"Lokaal mogelijk\",IF(Table1[[#This Row],[Schaalgrootte]]=\"Middelgroot\",\"Mogelijk samenwerking nodig\",IF(Table1[[#This Row],[Schaalgrootte]]=\"Individueel\",\"N.v.t.\",IF(Table1[[#This Row],[Schaalgrootte]]=\"Groot\",\"Mogelijk samenwerking nodig\",\"\"))))))","v":"Samenwerking noodzakelijk"},"Grote dorpen en/of stedelijke kernen","Gestapelde bouw, rijwoningen in stedelijke gebieden",{"$f":"IF(Table1[[#This Row],[Type net]]=\"Individueel\",\"Ja\",\"Nee\")","v":"Nee"}]
["Geothermie + HTO","Warmtenet","Warmtenet - Geothermie + HTO","Centraal","N.v.t.",85,"HT","Geothermie wordt gecombineerd met hoge temperatuur opslag en via het warmtenet geleverd. Dit systeem werkt op HT-niveau (> 75°C), maakt gebruik van een centrale warmtepomp en levert warmte via hoge temperatuur radiatoren of bestaande afgiftesystemen.",{"$f":"IF(Table1[[#This Row],[Aflevertemperatuur]]=\"ZLT\",\"A-B\",IF(Table1[[#This Row],[Aflevertemperatuur]]=\"LT\",\"A-C\",IF(Table1[[#This Row],[Aflevertemperatuur]]=\"MT\",\"A-D\",IF(Table1[[#This Row],[Aflevertemperatuur]]=\"HT\",\"Alles\",IF(Table1[[#This Row],[Aflevertemperatuur]]=\"LT/MT\",\"A-D\")))))","v":"Alles"},"Nee","Hoge dichtheid","Zeer groot",3,"Ja","Nee","Ja",{"$f":"IF(Table1[[#This Row],[Schaalgrootte]]=\"Middel\",\"Lokaal mogelijk\",IF(Table1[[#This Row],[Schaalgrootte]]=\"Zeer groot\",\"Samenwerking noodzakelijk\",IF(Table1[[#This Row],[Schaalgrootte]]=\"Klein\",\"Lokaal mogelijk\",IF(Table1[[#This Row],[Schaalgrootte]]=\"Middelgroot\",\"Mogelijk samenwerking nodig\",IF(Table1[[#This Row],[Schaalgrootte]]=\"Individueel\",\"N.v.t.\",IF(Table1[[#This Row],[Schaalgrootte]]=\"Groot\",\"Mogelijk samenwerking nodig\",\"\"))))))","v":"Samenwerking noodzakelijk"},"Grote dorpen en/of stedelijke kernen","Gestapelde bouw, rijwoningen in stedelijke gebieden",{"$f":"IF(Table1[[#This Row],[Type net]]=\"Individueel\",\"Ja\",\"Nee\")","v":"Nee"}]
["Industriele restwarmte","Warmtenet","Warmtenet - Industriele restwarmte","Centraal","S2d",110,"HT","Restwarmte uit industrie wordt via een warmtenet geleverd. Dit systeem werkt op HT-niveau (> 75°C), maakt gebruik van een centrale warmtepomp en levert warmte via hoge temperatuur radiatoren of bestaande afgiftesystemen.",{"$f":"IF(Table1[[#This Row],[Aflevertemperatuur]]=\"ZLT\",\"A-B\",IF(Table1[[#This Row],[Aflevertemperatuur]]=\"LT\",\"A-C\",IF(Table1[[#This Row],[Aflevertemperatuur]]=\"MT\",\"A-D\",IF(Table1[[#This Row],[Aflevertemperatuur]]=\"HT\",\"Alles\",IF(Table1[[#This Row],[Aflevertemperatuur]]=\"LT/MT\",\"A-D\")))))","v":"Alles"},{"$f":"IF(Table1[[#This Row],[Opwaardering]]=\"Decentraal\",\"Nee\",IF(Table1[[#This Row],[Opwaardering]]=\"N.v.t.\",\"Nee\",\"Ja\"))","v":"Ja"},"Middelhoge dichtheid","Groot",1,"Ja","Nee","Nee",{"$f":"IF(Table1[[#This Row],[Schaalgrootte]]=\"Middel\",\"Lokaal mogelijk\",IF(Table1[[#This Row],[Schaalgrootte]]=\"Zeer groot\",\"Samenwerking noodzakelijk\",IF(Table1[[#This Row],[Schaalgrootte]]=\"Klein\",\"Lokaal mogelijk\",IF(Table1[[#This Row],[Schaalgrootte]]=\"Middelgroot\",\"Mogelijk samenwerking nodig\",IF(Table1[[#This Row],[Schaalgrootte]]=\"Individueel\",\"N.v.t.\",IF(Table1[[#This Row],[Schaalgrootte]]=\"Groot\",\"Mogelijk samenwerking nodig\",\"\"))))))","v":"Mogelijk samenwerking nodig"},"Grote dorpen en/of stedelijke kernen","Gestapelde bouw, rijwoningen in stedelijke gebieden",{"$f":"IF(Table1[[#This Row],[Type net]]=\"Individueel\",\"Ja\",\"Nee\")","v":"Nee"}]
["Industriële restwarmte + HTO","Warmtenet","Warmtenet - Industriële restwarmte + HTO","Centraal","N.v.t.",110,"HT","Restwarmte uit industrie wordt opgeslagen in HTO en via het warmtenet geleverd. Dit systeem werkt op HT-niveau (> 75°C), maakt gebruik van een centrale warmtepomp en levert warmte via hoge temperatuur radiatoren of bestaande afgiftesystemen.",{"$f":"IF(Table1[[#This Row],[Aflevertemperatuur]]=\"ZLT\",\"A-B\",IF(Table1[[#This Row],[Aflevertemperatuur]]=\"LT\",\"A-C\",IF(Table1[[#This Row],[Aflevertemperatuur]]=\"MT\",\"A-D\",IF(Table1[[#This Row],[Aflevertemperatuur]]=\"HT\",\"Alles\",IF(Table1[[#This Row],[Aflevertemperatuur]]=\"LT/MT\",\"A-D\")))))","v":"Alles"},"Nee","Middelhoge dichtheid","Zeer groot",1,"Ja","Nee","Ja",{"$f":"IF(Table1[[#This Row],[Schaalgrootte]]=\"Middel\",\"Lokaal mogelijk\",IF(Table1[[#This Row],[Schaalgrootte]]=\"Zeer groot\",\"Samenwerking noodzakelijk\",IF(Table1[[#This Row],[Schaalgrootte]]=\"Klein\",\"Lokaal mogelijk\",IF(Table1[[#This Row],[Schaalgrootte]]=\"Middelgroot\",\"Mogelijk samenwerking nodig\",IF(Table1[[#This Row],[Schaalgrootte]]=\"Individueel\",\"N.v.t.\",IF(Table1[[#This Row],[Schaalgrootte]]=\"Groot\",\"Mogelijk samenwerking nodig\",\"\"))))))","v":"Samenwerking noodzakelijk"},"Grote dorpen en/of stedelijke kernen","Gestapelde bouw, rijwoningen in stedelijke gebieden",{"$f":"IF(Table1[[#This Row],[Type net]]=\"Individueel\",\"Ja\",\"Nee\")","v":"Nee"}]
["Ondiepe geothermie","Bronnet","Bronnet - Ondiepe geothermie","Decentraal","N.v.t.",37.5,"LT","Ondiepe geothermie, gekoppeld aan een decentrale warmtepomp in de woning. Dit systeem werkt op LT-niveau (25-40°C), maakt gebruik van een decentrale warmtepomp en levert warmte via vloerverwarming of lage temperatuur radiatoren.",{"$f":"IF(Table1[[#This Row],[Aflevertemperatuur]]=\"ZLT\",\"A-B\",IF(Table1[[#This Row],[Aflevertemperatuur]]=\"LT\",\"A-C\",IF(Table1[[#This Row],[Aflevertemperatuur]]=\"MT\",\"A-D\",IF(Table1[[#This Row],[Aflevertemperatuur]]=\"HT\",\"Alles\",IF(Table1[[#This Row],[Aflevertemperatuur]]=\"LT/MT\",\"A-D\")))))","v":"A-C"},{"$f":"IF(Table1[[#This Row],[Opwaardering]]=\"Decentraal\",\"Nee\",IF(Table1[[#This Row],[Opwaardering]]=\"N.v.t.\",\"Nee\",\"Ja\"))","v":"Nee"},"Middelhoge dichtheid","Groot",3,"Ja","Nee","Ja",{"$f":"IF(Table1[[#This Row],[Schaalgrootte]]=\"Middel\",\"Lokaal mogelijk\",IF(Table1[[#This Row],[Schaalgrootte]]=\"Zeer groot\",\"Samenwerking noodzakelijk\",IF(Table1[[#This Row],[Schaalgrootte]]=\"Klein\",\"Lokaal mogelijk\",IF(Table1[[#This Row],[Schaalgrootte]]=\"Middelgroot\",\"Mogelijk samenwerking nodig\",IF(Table1[[#This Row],[Schaalgrootte]]=\"Individueel\",\"N.v.t.\",IF(Table1[[#This Row],[Schaalgrootte]]=\"Groot\",\"Mogelijk samenwerking nodig\",\"\"))))))","v":"Mogelijk samenwerking nodig"},"Grote dorpen en/of stedelijke kernen","Gestapelde bouw, rijwoningen, kleine apartementen",{"$f":"IF(Table1[[#This Row],[Type net]]=\"Individueel\",\"Ja\",\"Nee\")","v":"Nee"}]
["Ondiepe geothermie​","Warmtenet","Warmtenet - Ondiepe geothermie​","Centraal","N.v.t.",37.5,"LT","Warmte uit ondiepe geothermie wordt centraal opgewekt en via een warmtenet geleverd aan woningen. Dit systeem werkt op LT-niveau (25-40°C), maakt gebruik van een centraal warmtepomp en levert warmte via vloerverwarming of lage temperatuur radiatoren.",{"$f":"IF(Table1[[#This Row],[Aflevertemperatuur]]=\"ZLT\",\"A-B\",IF(Table1[[#This Row],[Aflevertemperatuur]]=\"LT\",\"A-C\",IF(Table1[[#This Row],[Aflevertemperatuur]]=\"MT\",\"A-D\",IF(Table1[[#This Row],[Aflevertemperatuur]]=\"HT\",\"Alles\",IF(Table1[[#This Row],[Aflevertemperatuur]]=\"LT/MT\",\"A-D\")))))","v":"A-C"},{"$f":"IF(Table1[[#This Row],[Opwaardering]]=\"Decentraal\",\"Nee\",IF(Table1[[#This Row],[Opwaardering]]=\"N.v.t.\",\"Nee\",\"Ja\"))","v":"Ja"},"Middelhoge dichtheid","Groot",2,"Ja","Nee","Ja",{"$f":"IF(Table1[[#This Row],[Schaalgrootte]]=\"Middel\",\"Lokaal mogelijk\",IF(Table1[[#This Row],[Schaalgrootte]]=\"Zeer groot\",\"Samenwerking noodzakelijk\",IF(Table1[[#This Row],[Schaalgrootte]]=\"Klein\",\"Lokaal mogelijk\",IF(Table1[[#This Row],[Schaalgrootte]]=\"Middelgroot\",\"Mogelijk samenwerking nodig\",IF(Table1[[#This Row],[Schaalgrootte]]=\"Individueel\",\"N.v.t.\",IF(Table1[[#This Row],[Schaalgrootte]]=\"Groot\",\"Mogelijk samenwerking nodig\",\"\"))))))","v":"Mogelijk samenwerking nodig"},"Grote dorpen en/of stedelijke kernen","Gestapelde bouw, rijwoningen, kleine apartementen",{"$f":"IF(Table1[[#This Row],[Type net]]=\"Individueel\",\"Ja\",\"Nee\")","v":"Nee"}]
["Power-to-heat","Warmtenet","Warmtenet - Power-to-heat","N.v.t.","N.v.t.",75,"MT","Elektriciteit wordt omgezet in warmte via een centrale installatie. Warmte wordt via het warmtenet geleverd. Dit systeem werkt op MT-niveau (40-75°C), levert warmte via radiatoren of convectoren.",{"$f":"IF(Table1[[#This Row],[Aflevertemperatuur]]=\"ZLT\",\"A-B\",IF(Table1[[#This Row],[Aflevertemperatuur]]=\"LT\",\"A-C\",IF(Table1[[#This Row],[Aflevertemperatuur]]=\"MT\",\"A-D\",IF(Table1[[#This Row],[Aflevertemperatuur]]=\"HT\",\"Alles\",IF(Table1[[#This Row],[Aflevertemperatuur]]=\"LT/MT\",\"A-D\")))))","v":"A-D"},{"$f":"IF(Table1[[#This Row],[Opwaardering]]=\"Decentraal\",\"Nee\",IF(Table1[[#This Row],[Opwaardering]]=\"N.v.t.\",\"Nee\",\"Ja\"))","v":"Nee"},"Middelhoge dichtheid","Zeer groot",6,"Ja","Nee","Nee",{"$f":"IF(Table1[[#This Row],[Schaalgrootte]]=\"Middel\",\"Lokaal mogelijk\",IF(Table1[[#This Row],[Schaalgrootte]]=\"Zeer groot\",\"Samenwerking noodzakelijk\",IF(Table1[[#This Row],[Schaalgrootte]]=\"Klein\",\"Lokaal mogelijk\",IF(Table1[[#This Row],[Schaalgrootte]]=\"Middelgroot\",\"Mogelijk samenwerking nodig\",IF(Table1[[#This Row],[Schaalgrootte]]=\"Individueel\",\"N.v.t.\",IF(Table1[[#This Row],[Schaalgrootte]]=\"Groot\",\"Mogelijk samenwerking nodig\",\"\"))))))","v":"Samenwerking noodzakelijk"},"Grote dorpen en/of stedelijke kernen","Gestapelde bouw, rijwoningen in stedelijke gebieden",{"$f":"IF(Table1[[#This Row],[Type net]]=\"Individueel\",\"Ja\",\"Nee\")","v":"Nee"}]
["Datathermie MT","Warmtenet","Warmtenet - Datathermie MT","Centraal","N.v.t.",25,"MT","Restwarmte uit datacenters wordt centraal benut en via het warmtenet verspreid. Dit systeem werkt op MT-niveau (40-75°C), maakt gebruik van een centrale warmtepomp en levert warmte via vloerverwarming, lage temperatuur radiatoren of convectoren.",{"$f":"IF(Table1[[#This Row],[Aflevertemperatuur]]=\"ZLT\",\"A-B\",IF(Table1[[#This Row],[Aflevertemperatuur]]=\"LT\",\"A-C\",IF(Table1[[#This Row],[Aflevertemperatuur]]=\"MT\",\"A-D\",IF(Table1[[#This Row],[Aflevertemperatuur]]=\"HT\",\"Alles\",IF(Table1[[#This Row],[Aflevertemperatuur]]=\"LT/MT\",\"A-D\")))))","v":"A-D"},{"$f":"IF(Table1[[#This Row],[Opwaardering]]=\"Decentraal\",\"Nee\",IF(Table1[[#This Row],[Opwaardering]]=\"N.v.t.\",\"Nee\",\"Ja\"))","v":"Ja"},"Middelhoge dichtheid","Middel",4,"Ja","Nee","Nee",{"$f":"IF(Table1[[#This Row],[Schaalgrootte]]=\"Middel\",\"Lokaal mogelijk\",IF(Table1[[#This Row],[Schaalgrootte]]=\"Zeer groot\",\"Samenwerking noodzakelijk\",IF(Table1[[#This Row],[Schaalgrootte]]=\"Klein\",\"Lokaal mogelijk\",IF(Table1[[#This Row],[Schaalgrootte]]=\"Middelgroot\",\"Mogelijk samenwerking nodig\",IF(Table1[[#This Row],[Schaalgrootte]]=\"Individueel\",\"N.v.t.\",IF(Table1[[#This Row],[Schaalgrootte]]=\"Groot\",\"Mogelijk samenwerking nodig\",\"\"))))))","v":"Lokaal mogelijk"},"Grote dorpen en/of stedelijke kernen","Gestapelde bouw, rijwoningen in stedelijke gebieden",{"$f":"IF(Table1[[#This Row],[Type net]]=\"Individueel\",\"Ja\",\"Nee\")","v":"Nee"}]
["Open bodemenergie (WKO)","Bronnet","Bronnet - Open bodemenergie (WKO)","Decentraal","S3b",15,"ZLT","Open bodemenergiesysteem gekoppeld aan decentrale warmtepompen in woningen. Warmte wordt onttrokken uit de bodem en geleverd via ZLT/LT-afgiftesystemen (<25°C - 40°C), maakt gebruik van een decentraal warmtepomp en levert warmte via vloerverwarming of lage temperatuur radiatoren.",{"$f":"IF(Table1[[#This Row],[Aflevertemperatuur]]=\"ZLT\",\"A-B\",IF(Table1[[#This Row],[Aflevertemperatuur]]=\"LT\",\"A-C\",IF(Table1[[#This Row],[Aflevertemperatuur]]=\"MT\",\"A-D\",IF(Table1[[#This Row],[Aflevertemperatuur]]=\"HT\",\"Alles\",IF(Table1[[#This Row],[Aflevertemperatuur]]=\"LT/MT\",\"A-D\")))))","v":"A-B"},{"$f":"IF(Table1[[#This Row],[Opwaardering]]=\"Decentraal\",\"Nee\",IF(Table1[[#This Row],[Opwaardering]]=\"N.v.t.\",\"Nee\",\"Ja\"))","v":"Nee"},"Middelhoge dichtheid","Klein",4,"Nee, mogelijke restrictie toepasbaarheid","Nee","Ja",{"$f":"IF(Table1[[#This Row],[Schaalgrootte]]=\"Middel\",\"Lokaal mogelijk\",IF(Table1[[#This Row],[Schaalgrootte]]=\"Zeer groot\",\"Samenwerking noodzakelijk\",IF(Table1[[#This Row],[Schaalgrootte]]=\"Klein\",\"Lokaal mogelijk\",IF(Table1[[#This Row],[Schaalgrootte]]=\"Middelgroot\",\"Mogelijk samenwerking nodig\",IF(Table1[[#This Row],[Schaalgrootte]]=\"Individueel\",\"N.v.t.\",IF(Table1[[#This Row],[Schaalgrootte]]=\"Groot\",\"Mogelijk samenwerking nodig\",\"\"))))))","v":"Lokaal mogelijk"},"Grote dorpen en/of stedelijke kernen","Gestapelde bouw, rijwoningen, kleine apartementen",{"$f":"IF(Table1[[#This Row],[Type net]]=\"Individueel\",\"Ja\",\"Nee\")","v":"Nee"}]
["Open bodemenergie​ LT (WKO)","Warmtenet","Warmtenet - Open bodemenergie​ LT (WKO)","Centraal","S3d",15,"LT","WKO-systeem levert warmte via een centrale warmtepomp aan een warmtenet. Dit systeem werkt op LT/MT-niveau (25-75°C), maakt gebruik van een centrale warmtepomp en levert warmte via vloerverwarming, lage temperatuur radiatoren of convectoren.",{"$f":"IF(Table1[[#This Row],[Aflevertemperatuur]]=\"ZLT\",\"A-B\",IF(Table1[[#This Row],[Aflevertemperatuur]]=\"LT\",\"A-C\",IF(Table1[[#This Row],[Aflevertemperatuur]]=\"MT\",\"A-D\",IF(Table1[[#This Row],[Aflevertemperatuur]]=\"HT\",\"Alles\",IF(Table1[[#This Row],[Aflevertemperatuur]]=\"LT/MT\",\"A-D\")))))","v":"A-C"},{"$f":"IF(Table1[[#This Row],[Opwaardering]]=\"Decentraal\",\"Nee\",IF(Table1[[#This Row],[Opwaardering]]=\"N.v.t.\",\"Nee\",\"Ja\"))","v":"Ja"},"Middelhoge dichtheid","Klein",3,"Nee, mogelijke restrictie toepasbaarheid","Nee","Ja",{"$f":"IF(Table1[[#This Row],[Schaalgrootte]]=\"Middel\",\"Lokaal mogelijk\",IF(Table1[[#This Row],[Schaalgrootte]]=\"Zeer groot\",\"Samenwerking noodzakelijk\",IF(Table1[[#This Row],[Schaalgrootte]]=\"Klein\",\"Lokaal mogelijk\",IF(Table1[[#This Row],[Schaalgrootte]]=\"Middelgroot\",\"Mogelijk samenwerking nodig\",IF(Table1[[#This Row],[Schaalgrootte]]=\"Individueel\",\"N.v.t.\",IF(Table1[[#This Row],[Schaalgrootte]]=\"Groot\",\"Mogelijk samenwerking nodig\",\"\"))))))","v":"Lokaal mogelijk"},"Grote dorpen en/of stedelijke kernen","Gestapelde bouw, rijwoningen, kleine apartementen",{"$f":"IF(Table1[[#This Row],[Type net]]=\"Individueel\",\"Ja\",\"Nee\")","v":"Nee"}]
["Open bodemenergie​ MT (WKO)","Warmtenet","Warmtenet - Open bodemenergie​ MT (WKO)","Centraal","S3d",15,"MT","WKO-systeem levert warmte via een centrale warmtepomp aan een warmtenet. Dit systeem werkt op MT-niveau (40-75°C), maakt gebruik van een centrale warmtepomp en levert warmte via vloerverwarming, lage temperatuur radiatoren of convectoren.",{"$f":"IF(Table1[[#This Row],[Aflevertemperatuur]]=\"ZLT\",\"A-B\",IF(Table1[[#This Row],[Aflevertemperatuur]]=\"LT\",\"A-C\",IF(Table1[[#This Row],[Aflevertemperatuur]]=\"MT\",\"A-D\",IF(Table1[[#This Row],[Aflevertemperatuur]]=\"HT\",\"Alles\",IF(Table1[[#This Row],[Aflevertemperatuur]]=\"LT/MT\",\"A-D\")))))","v":"A-D"},{"$f":"IF(Table1[[#This Row],[Opwaardering]]=\"Decentraal\",\"Nee\",IF(Table1[[#This Row],[Opwaardering]]=\"N.v.t.\",\"Nee\",\"Ja\"))","v":"Ja"},"Middelhoge dichtheid","Klein",4,"Nee, mogelijke restrictie toepasbaarheid","Nee","Ja",{"$f":"IF(Table1[[#This Row],[Schaalgrootte]]=\"Middel\",\"Lokaal mogelijk\",IF(Table1[[#This Row],[Schaalgrootte]]=\"Zeer groot\",\"Samenwerking noodzakelijk\",IF(Table1[[#This Row],[Schaalgrootte]]=\"Klein\",\"Lokaal mogelijk\",IF(Table1[[#This Row],[Schaalgrootte]]=\"Middelgroot\",\"Mogelijk samenwerking nodig\",IF(Table1[[#This Row],[Schaalgrootte]]=\"Individueel\",\"N.v.t.\",IF(Table1[[#This Row],[Schaalgrootte]]=\"Groot\",\"Mogelijk samenwerking nodig\",\"\"))))))","v":"Lokaal mogelijk"},"Grote dorpen en/of stedelijke kernen","Gestapelde bouw, rijwoningen, kleine apartementen",{"$f":"IF(Table1[[#This Row],[Type net]]=\"Individueel\",\"Ja\",\"Nee\")","v":"Nee"}]
["CV klimaatneutraal gas","Individueel","Individueel - CV klimaatneutraal gas","N.v.t.","N.v.t.",85,"HT","Verwarming via een cv-ketel op klimaatneutraalgas. Dit systeem werkt op HT-niveau (> 75°C), maakt gebruik van hoge temperatuur radiatoren of bestaande afgiftesystemen.",{"$f":"IF(Table1[[#This Row],[Aflevertemperatuur]]=\"ZLT\",\"A-B\",IF(Table1[[#This Row],[Aflevertemperatuur]]=\"LT\",\"A-C\",IF(Table1[[#This Row],[Aflevertemperatuur]]=\"MT\",\"A-D\",IF(Table1[[#This Row],[Aflevertemperatuur]]=\"HT\",\"Alles\",IF(Table1[[#This Row],[Aflevertemperatuur]]=\"LT/MT\",\"A-D\")))))","v":"Alles"},{"$f":"IF(Table1[[#This Row],[Opwaardering]]=\"Decentraal\",\"Nee\",IF(Table1[[#This Row],[Opwaardering]]=\"N.v.t.\",\"Nee\",\"Ja\"))","v":"Nee"},"N.v.t.","Individueel","N.v.t.","Nee","Nee","Nee",{"$f":"IF(Table1[[#This Row],[Schaalgrootte]]=\"Middel\",\"Lokaal mogelijk\",IF(Table1[[#This Row],[Schaalgrootte]]=\"Zeer groot\",\"Samenwerking noodzakelijk\",IF(Table1[[#This Row],[Schaalgrootte]]=\"Klein\",\"Lokaal mogelijk\",IF(Table1[[#This Row],[Schaalgrootte]]=\"Middelgroot\",\"Mogelijk samenwerking nodig\",IF(Table1[[#This Row],[Schaalgrootte]]=\"Individueel\",\"N.v.t.\",IF(Table1[[#This Row],[Schaalgrootte]]=\"Groot\",\"Mogelijk samenwerking nodig\",\"\"))))))","v":"N.v.t."},"Maakt niet uit","Alle woningtypes",{"$f":"IF(Table1[[#This Row],[Type net]]=\"Individueel\",\"Ja\",\"Nee\")","v":"Ja"}]
["CV klimaatneutraal gas","Warmtenet","Warmtenet - CV klimaatneutraal gas","N.v.t.","N.v.t.",110,"HT","Verwarming via een CV ketel op klimaatneutraal gas dat aangelverd wordt via een warmtenet. Dit systeem werkt op HT-niveau (> 75°C), maakt gebruik van een hoge temperatuur radiatoren of bestaande afgiftesystemen.",{"$f":"IF(Table1[[#This Row],[Aflevertemperatuur]]=\"ZLT\",\"A-B\",IF(Table1[[#This Row],[Aflevertemperatuur]]=\"LT\",\"A-C\",IF(Table1[[#This Row],[Aflevertemperatuur]]=\"MT\",\"A-D\",IF(Table1[[#This Row],[Aflevertemperatuur]]=\"HT\",\"Alles\",IF(Table1[[#This Row],[Aflevertemperatuur]]=\"LT/MT\",\"A-D\")))))","v":"Alles"},{"$f":"IF(Table1[[#This Row],[Opwaardering]]=\"Decentraal\",\"Nee\",IF(Table1[[#This Row],[Opwaardering]]=\"N.v.t.\",\"Nee\",\"Ja\"))","v":"Nee"},"Middelhoge dichtheid","Middel","N.v.t.","Nee","Ja","Nee",{"$f":"IF(Table1[[#This Row],[Schaalgrootte]]=\"Middel\",\"Lokaal mogelijk\",IF(Table1[[#This Row],[Schaalgrootte]]=\"Zeer groot\",\"Samenwerking noodzakelijk\",IF(Table1[[#This Row],[Schaalgrootte]]=\"Klein\",\"Lokaal mogelijk\",IF(Table1[[#This Row],[Schaalgrootte]]=\"Middelgroot\",\"Mogelijk samenwerking nodig\",IF(Table1[[#This Row],[Schaalgrootte]]=\"Individueel\",\"N.v.t.\",IF(Table1[[#This Row],[Schaalgrootte]]=\"Groot\",\"Mogelijk samenwerking nodig\",\"\"))))))","v":"Lokaal mogelijk"},"Maakt niet uit","Gestapelde bouw, rijwoningen in stedelijke gebieden",{"$f":"IF(Table1[[#This Row],[Type net]]=\"Individueel\",\"Ja\",\"Nee\")","v":"Nee"}]
["Elektrische warmte","Individueel","Individueel - Elektrische warmte","N.v.t.","N.v.t.",60,"MT","Elektrische verwarming via radiatoren of infraroodpanelen. Geen warmtepomp, directe omzetting van stroom naar warmte. Dit systeem werkt op MT-niveau (40-75°C), levert warmte via radiatoren of convectoren.",{"$f":"IF(Table1[[#This Row],[Aflevertemperatuur]]=\"ZLT\",\"A-B\",IF(Table1[[#This Row],[Aflevertemperatuur]]=\"LT\",\"A-C\",IF(Table1[[#This Row],[Aflevertemperatuur]]=\"MT\",\"A-D\",IF(Table1[[#This Row],[Aflevertemperatuur]]=\"HT\",\"Alles\",IF(Table1[[#This Row],[Aflevertemperatuur]]=\"LT/MT\",\"A-D\")))))","v":"A-D"},{"$f":"IF(Table1[[#This Row],[Opwaardering]]=\"Decentraal\",\"Nee\",IF(Table1[[#This Row],[Opwaardering]]=\"N.v.t.\",\"Nee\",\"Ja\"))","v":"Nee"},"N.v.t.","Individueel",6,"Nee","Nee","Nee",{"$f":"IF(Table1[[#This Row],[Schaalgrootte]]=\"Middel\",\"Lokaal mogelijk\",IF(Table1[[#This Row],[Schaalgrootte]]=\"Zeer groot\",\"Samenwerking noodzakelijk\",IF(Table1[[#This Row],[Schaalgrootte]]=\"Klein\",\"Lokaal mogelijk\",IF(Table1[[#This Row],[Schaalgrootte]]=\"Middelgroot\",\"Mogelijk samenwerking nodig\",IF(Table1[[#This Row],[Schaalgrootte]]=\"Individueel\",\"N.v.t.\",IF(Table1[[#This Row],[Schaalgrootte]]=\"Groot\",\"Mogelijk samenwerking nodig\",\"\"))))))","v":"N.v.t."},"Maakt niet uit","Kleine woningen, tijdelijke bouw",{"$f":"IF(Table1[[#This Row],[Type net]]=\"Individueel\",\"Ja\",\"Nee\")","v":"Ja"}]
["Hybride warmtepomp","Individueel","Individueel - Hybride warmtepomp","N.v.t.","S4b",60,"MT","Combinatie van een warmtepomp en een cv-ketel. Warmtepomp levert MT, ketel springt bij voor piekvraag. Dit systeem werkt op MT-niveau (40-75°C), maakt gebruik van een warmtepomp en levert warmte via radiatoren of convectoren.",{"$f":"IF(Table1[[#This Row],[Aflevertemperatuur]]=\"ZLT\",\"A-B\",IF(Table1[[#This Row],[Aflevertemperatuur]]=\"LT\",\"A-C\",IF(Table1[[#This Row],[Aflevertemperatuur]]=\"MT\",\"A-D\",IF(Table1[[#This Row],[Aflevertemperatuur]]=\"HT\",\"Alles\",IF(Table1[[#This Row],[Aflevertemperatuur]]=\"LT/MT\",\"A-D\")))))","v":"A-D"},{"$f":"IF(Table1[[#This Row],[Opwaardering]]=\"Decentraal\",\"Nee\",IF(Table1[[#This Row],[Opwaardering]]=\"N.v.t.\",\"Nee\",\"Ja\"))","v":"Nee"},"N.v.t.","Individueel",4,"Nee","Nee","Nee",{"$f":"IF(Table1[[#This Row],[Schaalgrootte]]=\"Middel\",\"Lokaal mogelijk\",IF(Table1[[#This Row],[Schaalgrootte]]=\"Zeer groot\",\"Samenwerking noodzakelijk\",IF(Table1[[#This Row],[Schaalgrootte]]=\"Klein\",\"Lokaal mogelijk\",IF(Table1[[#This Row],[Schaalgrootte]]=\"Middelgroot\",\"Mogelijk samenwerking nodig\",IF(Table1[[#This Row],[Schaalgrootte]]=\"Individueel\",\"N.v.t.\",IF(Table1[[#This Row],[Schaalgrootte]]=\"Groot\",\"Mogelijk samenwerking nodig\",\"\"))))))","v":"N.v.t."},"Maakt niet uit","Rijwoningen, kleine apartementen",{"$f":"IF(Table1[[#This Row],[Type net]]=\"Individueel\",\"Ja\",\"Nee\")","v":"Ja"}]
["Lucht/lucht warmtepomp","Individueel","Individueel - Lucht/lucht warmtepomp","N.v.t.","S1a",7.5,"ZLT","Buitenlucht wordt gebruikt als bron voor een warmtepomp die via luchtcirculatie verwarmt. Dit systeem werkt op ZLT-niveau (< 25°C), maakt gebruik van een warmtepomp en levert warmte via vloerverwarming of lage temperatuur radiatoren.",{"$f":"IF(Table1[[#This Row],[Aflevertemperatuur]]=\"ZLT\",\"A-B\",IF(Table1[[#This Row],[Aflevertemperatuur]]=\"LT\",\"A-C\",IF(Table1[[#This Row],[Aflevertemperatuur]]=\"MT\",\"A-D\",IF(Table1[[#This Row],[Aflevertemperatuur]]=\"HT\",\"Alles\",IF(Table1[[#This Row],[Aflevertemperatuur]]=\"LT/MT\",\"A-D\")))))","v":"A-B"},{"$f":"IF(Table1[[#This Row],[Opwaardering]]=\"Decentraal\",\"Nee\",IF(Table1[[#This Row],[Opwaardering]]=\"N.v.t.\",\"Nee\",\"Ja\"))","v":"Nee"},"N.v.t.","Individueel",6,"Nee","Nee","Nee",{"$f":"IF(Table1[[#This Row],[Schaalgrootte]]=\"Middel\",\"Lokaal mogelijk\",IF(Table1[[#This Row],[Schaalgrootte]]=\"Zeer groot\",\"Samenwerking noodzakelijk\",IF(Table1[[#This Row],[Schaalgrootte]]=\"Klein\",\"Lokaal mogelijk\",IF(Table1[[#This Row],[Schaalgrootte]]=\"Middelgroot\",\"Mogelijk samenwerking nodig\",IF(Table1[[#This Row],[Schaalgrootte]]=\"Individueel\",\"N.v.t.\",IF(Table1[[#This Row],[Schaalgrootte]]=\"Groot\",\"Mogelijk samenwerking nodig\",\"\"))))))","v":"N.v.t."},"Maakt niet uit","Kleine woningen, tijdelijke bouw",{"$f":"IF(Table1[[#This Row],[Type net]]=\"Individueel\",\"Ja\",\"Nee\")","v":"Ja"}]
["Lucht/water warmtepomp​","Individueel","Individueel - Lucht/water warmtepomp​","N.v.t.","S1a",7.5,"ZLT","Buitenlucht wordt gebruikt als bron voor een individuele warmtepomp. Dit systeem werkt op ZLT-niveau (< 25°C), maakt gebruik van een warmtepomp en levert warmte via vloerverwarming of lage temperatuur radiatoren.",{"$f":"IF(Table1[[#This Row],[Aflevertemperatuur]]=\"ZLT\",\"A-B\",IF(Table1[[#This Row],[Aflevertemperatuur]]=\"LT\",\"A-C\",IF(Table1[[#This Row],[Aflevertemperatuur]]=\"MT\",\"A-D\",IF(Table1[[#This Row],[Aflevertemperatuur]]=\"HT\",\"Alles\",IF(Table1[[#This Row],[Aflevertemperatuur]]=\"LT/MT\",\"A-D\")))))","v":"A-B"},{"$f":"IF(Table1[[#This Row],[Opwaardering]]=\"Decentraal\",\"Nee\",IF(Table1[[#This Row],[Opwaardering]]=\"N.v.t.\",\"Nee\",\"Ja\"))","v":"Nee"},"N.v.t.","Individueel",6,"Nee","Nee","Nee",{"$f":"IF(Table1[[#This Row],[Schaalgrootte]]=\"Middel\",\"Lokaal mogelijk\",IF(Table1[[#This Row],[Schaalgrootte]]=\"Zeer groot\",\"Samenwerking noodzakelijk\",IF(Table1[[#This Row],[Schaalgrootte]]=\"Klein\",\"Lokaal mogelijk\",IF(Table1[[#This Row],[Schaalgrootte]]=\"Middelgroot\",\"Mogelijk samenwerking nodig\",IF(Table1[[#This Row],[Schaalgrootte]]=\"Individueel\",\"N.v.t.\",IF(Table1[[#This Row],[Schaalgrootte]]=\"Groot\",\"Mogelijk samenwerking nodig\",\"\"))))))","v":"N.v.t."},"Maakt niet uit","Alles behalve hoogbouw",{"$f":"IF(Table1[[#This Row],[Type net]]=\"Individueel\",\"Ja\",\"Nee\")","v":"Ja"}]
["PVT","Individueel","Individueel - PVT","N.v.t.","N.v.t.",45,"LT","PVT-panelen leveren thermische energie direct aan een individuele warmtepomp en/of buffervat. Dit systeem werkt op LT-niveau (25-40°C), maakt gebruik van een warmtepomp en levert warmte via vloerverwarming of lage temperatuur radiatoren.",{"$f":"IF(Table1[[#This Row],[Aflevertemperatuur]]=\"ZLT\",\"A-B\",IF(Table1[[#This Row],[Aflevertemperatuur]]=\"LT\",\"A-C\",IF(Table1[[#This Row],[Aflevertemperatuur]]=\"MT\",\"A-D\",IF(Table1[[#This Row],[Aflevertemperatuur]]=\"HT\",\"Alles\",IF(Table1[[#This Row],[Aflevertemperatuur]]=\"LT/MT\",\"A-D\")))))","v":"A-C"},{"$f":"IF(Table1[[#This Row],[Opwaardering]]=\"Decentraal\",\"Nee\",IF(Table1[[#This Row],[Opwaardering]]=\"N.v.t.\",\"Nee\",\"Ja\"))","v":"Nee"},"N.v.t.","Individueel",3,"Nee","Nee","Nee",{"$f":"IF(Table1[[#This Row],[Schaalgrootte]]=\"Middel\",\"Lokaal mogelijk\",IF(Table1[[#This Row],[Schaalgrootte]]=\"Zeer groot\",\"Samenwerking noodzakelijk\",IF(Table1[[#This Row],[Schaalgrootte]]=\"Klein\",\"Lokaal mogelijk\",IF(Table1[[#This Row],[Schaalgrootte]]=\"Middelgroot\",\"Mogelijk samenwerking nodig\",IF(Table1[[#This Row],[Schaalgrootte]]=\"Individueel\",\"N.v.t.\",IF(Table1[[#This Row],[Schaalgrootte]]=\"Groot\",\"Mogelijk samenwerking nodig\",\"\"))))))","v":"N.v.t."},"Maakt niet uit","Woningen met dakoppervlak",{"$f":"IF(Table1[[#This Row],[Type net]]=\"Individueel\",\"Ja\",\"Nee\")","v":"Ja"}]
["Zonnecollectoren","Individueel","Individueel - Zonnecollectoren","N.v.t.","N.v.t.",45,"LT","Zonthermische energie wordt via individuele zonnecollectoren direct geleverd aan een gebouwgebonden systeem. Dit systeem werkt op LT-niveau (lage temperatuur, ca. 45°C) en levert warmte via vloerverwarming of lage temperatuur radiatoren.",{"$f":"IF(Table1[[#This Row],[Aflevertemperatuur]]=\"ZLT\",\"A-B\",IF(Table1[[#This Row],[Aflevertemperatuur]]=\"LT\",\"A-C\",IF(Table1[[#This Row],[Aflevertemperatuur]]=\"MT\",\"A-D\",IF(Table1[[#This Row],[Aflevertemperatuur]]=\"HT\",\"Alles\",IF(Table1[[#This Row],[Aflevertemperatuur]]=\"LT/MT\",\"A-D\")))))","v":"A-C"},{"$f":"IF(Table1[[#This Row],[Opwaardering]]=\"Decentraal\",\"Nee\",IF(Table1[[#This Row],[Opwaardering]]=\"N.v.t.\",\"Nee\",\"Ja\"))","v":"Nee"},"N.v.t.","Individueel",2,"Nee","Nee","Nee",{"$f":"IF(Table1[[#This Row],[Schaalgrootte]]=\"Middel\",\"Lokaal mogelijk\",IF(Table1[[#This Row],[Schaalgrootte]]=\"Zeer groot\",\"Samenwerking noodzakelijk\",IF(Table1[[#This Row],[Schaalgrootte]]=\"Klein\",\"Lokaal mogelijk\",IF(Table1[[#This Row],[Schaalgrootte]]=\"Middelgroot\",\"Mogelijk samenwerking nodig\",IF(Table1[[#This Row],[Schaalgrootte]]=\"Individueel\",\"N.v.t.\",IF(Table1[[#This Row],[Schaalgrootte]]=\"Groot\",\"Mogelijk samenwerking nodig\",\"\"))))))","v":"N.v.t."},"Maakt niet uit","Woningen met dakoppervlak",{"$f":"IF(Table1[[#This Row],[Type net]]=\"Individueel\",\"Ja\",\"Nee\")","v":"Ja"}]
["Asfaltthermie - Thermische panelen in de weg","Bronnet","Bronnet - Asfaltthermie - Thermische panelen in de weg","Decentraal","N.v.t.",40,"LT","Thermische energie wordt gewonnen uit asfalt via ingegoten panelen, gekoppeld aan een decentrale warmtepomp in de woning. Dit systeem werkt op LT-niveau (25-40°C), maakt gebruik van een decentraal warmtepomp en levert warmte via vloerverwarming of lage temperatuur radiatoren.",{"$f":"IF(Table1[[#This Row],[Aflevertemperatuur]]=\"ZLT\",\"A-B\",IF(Table1[[#This Row],[Aflevertemperatuur]]=\"LT\",\"A-C\",IF(Table1[[#This Row],[Aflevertemperatuur]]=\"MT\",\"A-D\",IF(Table1[[#This Row],[Aflevertemperatuur]]=\"HT\",\"Alles\",IF(Table1[[#This Row],[Aflevertemperatuur]]=\"LT/MT\",\"A-D\")))))","v":"A-C"},{"$f":"IF(Table1[[#This Row],[Opwaardering]]=\"Decentraal\",\"Nee\",IF(Table1[[#This Row],[Opwaardering]]=\"N.v.t.\",\"Nee\",\"Ja\"))","v":"Nee"},"Middelhoge dichtheid","Middel",3,"Ja","Nee","Nee",{"$f":"IF(Table1[[#This Row],[Schaalgrootte]]=\"Middel\",\"Lokaal mogelijk\",IF(Table1[[#This Row],[Schaalgrootte]]=\"Zeer groot\",\"Samenwerking noodzakelijk\",IF(Table1[[#This Row],[Schaalgrootte]]=\"Klein\",\"Lokaal mogelijk\",IF(Table1[[#This Row],[Schaalgrootte]]=\"Middelgroot\",\"Mogelijk samenwerking nodig\",IF(Table1[[#This Row],[Schaalgrootte]]=\"Individueel\",\"N.v.t.\",IF(Table1[[#This Row],[Schaalgrootte]]=\"Groot\",\"Mogelijk samenwerking nodig\",\"\"))))))","v":"Lokaal mogelijk"},"Middelgrote dorpen en/of compacte wijken","Gestapelde bouw, rijwoningen, kleine apartementen",{"$f":"IF(Table1[[#This Row],[Type net]]=\"Individueel\",\"Ja\",\"Nee\")","v":"Nee"}]
["Asfaltthermie - Thermische panelen in de weg​ (WKO)","Warmtenet","Warmtenet - Asfaltthermie - Thermische panelen in de weg​ (WKO)","Centraal","S3d",40,"LT","Asfaltpanelen leveren warmte aan een WKO-buffer, dat via een centrale warmtepomp in het warmtenet wordt verspreid. Dit systeem werkt op LT-niveau (25-40°C), maakt gebruik van een centrale warmtepomp en levert warmte via vloerverwarming of lage temperatuur radiatoren.",{"$f":"IF(Table1[[#This Row],[Aflevertemperatuur]]=\"ZLT\",\"A-B\",IF(Table1[[#This Row],[Aflevertemperatuur]]=\"LT\",\"A-C\",IF(Table1[[#This Row],[Aflevertemperatuur]]=\"MT\",\"A-D\",IF(Table1[[#This Row],[Aflevertemperatuur]]=\"HT\",\"Alles\",IF(Table1[[#This Row],[Aflevertemperatuur]]=\"LT/MT\",\"A-D\")))))","v":"A-C"},{"$f":"IF(Table1[[#This Row],[Opwaardering]]=\"Decentraal\",\"Nee\",IF(Table1[[#This Row],[Opwaardering]]=\"N.v.t.\",\"Nee\",\"Ja\"))","v":"Ja"},"Middelhoge dichtheid","Middel",3,"Ja","Nee","Ja",{"$f":"IF(Table1[[#This Row],[Schaalgrootte]]=\"Middel\",\"Lokaal mogelijk\",IF(Table1[[#This Row],[Schaalgrootte]]=\"Zeer groot\",\"Samenwerking noodzakelijk\",IF(Table1[[#This Row],[Schaalgrootte]]=\"Klein\",\"Lokaal mogelijk\",IF(Table1[[#This Row],[Schaalgrootte]]=\"Middelgroot\",\"Mogelijk samenwerking nodig\",IF(Table1[[#This Row],[Schaalgrootte]]=\"Individueel\",\"N.v.t.\",IF(Table1[[#This Row],[Schaalgrootte]]=\"Groot\",\"Mogelijk samenwerking nodig\",\"\"))))))","v":"Lokaal mogelijk"},"Middelgrote dorpen en/of compacte wijken","Gestapelde bouw, woonwijken met rijwoningen",{"$f":"IF(Table1[[#This Row],[Type net]]=\"Individueel\",\"Ja\",\"Nee\")","v":"Nee"}]
["Gesloten bodemenergie​ LT","Warmtenet","Warmtenet - Gesloten bodemenergie​ LT","Centraal","S3d",10,"LT","Gesloten bodemlussen leveren warmte aan een centrale warmtepomp, die via een warmtenet verspreidt. Dit systeem werkt op LT/MT-niveau (25-75°C), maakt gebruik van een centrale warmtepomp en levert warmte via vloerverwarming, lage temperatuur radiatoren of convectoren.",{"$f":"IF(Table1[[#This Row],[Aflevertemperatuur]]=\"ZLT\",\"A-B\",IF(Table1[[#This Row],[Aflevertemperatuur]]=\"LT\",\"A-C\",IF(Table1[[#This Row],[Aflevertemperatuur]]=\"MT\",\"A-D\",IF(Table1[[#This Row],[Aflevertemperatuur]]=\"HT\",\"Alles\",IF(Table1[[#This Row],[Aflevertemperatuur]]=\"LT/MT\",\"A-D\")))))","v":"A-C"},{"$f":"IF(Table1[[#This Row],[Opwaardering]]=\"Decentraal\",\"Nee\",IF(Table1[[#This Row],[Opwaardering]]=\"N.v.t.\",\"Nee\",\"Ja\"))","v":"Ja"},"Middelhoge dichtheid","Klein",3,"Ja","Nee","Ja",{"$f":"IF(Table1[[#This Row],[Schaalgrootte]]=\"Middel\",\"Lokaal mogelijk\",IF(Table1[[#This Row],[Schaalgrootte]]=\"Zeer groot\",\"Samenwerking noodzakelijk\",IF(Table1[[#This Row],[Schaalgrootte]]=\"Klein\",\"Lokaal mogelijk\",IF(Table1[[#This Row],[Schaalgrootte]]=\"Middelgroot\",\"Mogelijk samenwerking nodig\",IF(Table1[[#This Row],[Schaalgrootte]]=\"Individueel\",\"N.v.t.\",IF(Table1[[#This Row],[Schaalgrootte]]=\"Groot\",\"Mogelijk samenwerking nodig\",\"\"))))))","v":"Lokaal mogelijk"},"Middelgrote dorpen en/of compacte wijken","Gestapelde bouw, rijwoningen, kleine apartementen",{"$f":"IF(Table1[[#This Row],[Type net]]=\"Individueel\",\"Ja\",\"Nee\")","v":"Nee"}]
["Sportveld thermie","Bronnet","Bronnet - Sportveld thermie","Decentraal","N.v.t.",20,"ZLT","Warmte wordt onttrokken uit sportvelden via ondergrondse leidingen, gekoppeld aan decentrale warmtepompen in de woningen. Dit systeem werkt op ZLT-niveau (< 25°C), maakt gebruik van een decentraal warmtepomp en levert warmte via vloerverwarming of lage temperatuur radiatoren.",{"$f":"IF(Table1[[#This Row],[Aflevertemperatuur]]=\"ZLT\",\"A-B\",IF(Table1[[#This Row],[Aflevertemperatuur]]=\"LT\",\"A-C\",IF(Table1[[#This Row],[Aflevertemperatuur]]=\"MT\",\"A-D\",IF(Table1[[#This Row],[Aflevertemperatuur]]=\"HT\",\"Alles\",IF(Table1[[#This Row],[Aflevertemperatuur]]=\"LT/MT\",\"A-D\")))))","v":"A-B"},{"$f":"IF(Table1[[#This Row],[Opwaardering]]=\"Decentraal\",\"Nee\",IF(Table1[[#This Row],[Opwaardering]]=\"N.v.t.\",\"Nee\",\"Ja\"))","v":"Nee"},"Middelhoge dichtheid","Middel",3,"Ja","Nee","Nee",{"$f":"IF(Table1[[#This Row],[Schaalgrootte]]=\"Middel\",\"Lokaal mogelijk\",IF(Table1[[#This Row],[Schaalgrootte]]=\"Zeer groot\",\"Samenwerking noodzakelijk\",IF(Table1[[#This Row],[Schaalgrootte]]=\"Klein\",\"Lokaal mogelijk\",IF(Table1[[#This Row],[Schaalgrootte]]=\"Middelgroot\",\"Mogelijk samenwerking nodig\",IF(Table1[[#This Row],[Schaalgrootte]]=\"Individueel\",\"N.v.t.\",IF(Table1[[#This Row],[Schaalgrootte]]=\"Groot\",\"Mogelijk samenwerking nodig\",\"\"))))))","v":"Lokaal mogelijk"},"Middelgrote dorpen en/of compacte wijken","Wijken nabij sportvelden",{"$f":"IF(Table1[[#This Row],[Type net]]=\"Individueel\",\"Ja\",\"Nee\")","v":"Nee"}]
["Sportveld thermie LT (met WKO)","Warmtenet","Warmtenet - Sportveld thermie LT (met WKO)","Centraal","S3d",15,"LT","Sportvelden leveren warmte aan een WKO-buffer, dat via een centrale warmtepomp in het warmtenet wordt verspreid. Dit systeem werkt op LT/MT-niveau (25-75°C), maakt gebruik van een centrale warmtepomp en levert warmte via vloerverwarming, lage temperatuur radiatoren of convectoren.",{"$f":"IF(Table1[[#This Row],[Aflevertemperatuur]]=\"ZLT\",\"A-B\",IF(Table1[[#This Row],[Aflevertemperatuur]]=\"LT\",\"A-C\",IF(Table1[[#This Row],[Aflevertemperatuur]]=\"MT\",\"A-D\",IF(Table1[[#This Row],[Aflevertemperatuur]]=\"HT\",\"Alles\",IF(Table1[[#This Row],[Aflevertemperatuur]]=\"LT/MT\",\"A-D\")))))","v":"A-C"},{"$f":"IF(Table1[[#This Row],[Opwaardering]]=\"Decentraal\",\"Nee\",IF(Table1[[#This Row],[Opwaardering]]=\"N.v.t.\",\"Nee\",\"Ja\"))","v":"Ja"},"Middelhoge dichtheid","Middel",4,"Ja","Nee","Ja",{"$f":"IF(Table1[[#This Row],[Schaalgrootte]]=\"Middel\",\"Lokaal mogelijk\",IF(Table1[[#This Row],[Schaalgrootte]]=\"Zeer groot\",\"Samenwerking noodzakelijk\",IF(Table1[[#This Row],[Schaalgrootte]]=\"Klein\",\"Lokaal mogelijk\",IF(Table1[[#This Row],[Schaalgrootte]]=\"Middelgroot\",\"Mogelijk samenwerking nodig\",IF(Table1[[#This Row],[Schaalgrootte]]=\"Individueel\",\"N.v.t.\",IF(Table1[[#This Row],[Schaalgrootte]]=\"Groot\",\"Mogelijk samenwerking nodig\",\"\"))))))","v":"Lokaal mogelijk"},"Middelgrote dorpen en/of compacte wijken","Wijken nabij sportvelden",{"$f":"IF(Table1[[#This Row],[Type net]]=\"Individueel\",\"Ja\",\"Nee\")","v":"Nee"}]
["Thermische energie uit afvalwater - leidingen (TEA)","Bronnet","Bronnet - Thermische energie uit afvalwater - leidingen (TEA)","Decentraal","N.v.t.",10,"ZLT","Warmte uit afvalwaterleidingen wordt lokaal onttrokken en via decentrale warmtepompen benut. Dit systeem werkt op ZLT-niveau (< 25°C), maakt gebruik van een decentraal warmtepomp en levert warmte via vloerverwarming of lage temperatuur radiatoren.",{"$f":"IF(Table1[[#This Row],[Aflevertemperatuur]]=\"ZLT\",\"A-B\",IF(Table1[[#This Row],[Aflevertemperatuur]]=\"LT\",\"A-C\",IF(Table1[[#This Row],[Aflevertemperatuur]]=\"MT\",\"A-D\",IF(Table1[[#This Row],[Aflevertemperatuur]]=\"HT\",\"Alles\",IF(Table1[[#This Row],[Aflevertemperatuur]]=\"LT/MT\",\"A-D\")))))","v":"A-B"},{"$f":"IF(Table1[[#This Row],[Opwaardering]]=\"Decentraal\",\"Nee\",IF(Table1[[#This Row],[Opwaardering]]=\"N.v.t.\",\"Nee\",\"Ja\"))","v":"Nee"},"Middelhoge dichtheid","Middel",3,"Ja","Nee","Ja",{"$f":"IF(Table1[[#This Row],[Schaalgrootte]]=\"Middel\",\"Lokaal mogelijk\",IF(Table1[[#This Row],[Schaalgrootte]]=\"Zeer groot\",\"Samenwerking noodzakelijk\",IF(Table1[[#This Row],[Schaalgrootte]]=\"Klein\",\"Lokaal mogelijk\",IF(Table1[[#This Row],[Schaalgrootte]]=\"Middelgroot\",\"Mogelijk samenwerking nodig\",IF(Table1[[#This Row],[Schaalgrootte]]=\"Individueel\",\"N.v.t.\",IF(Table1[[#This Row],[Schaalgrootte]]=\"Groot\",\"Mogelijk samenwerking nodig\",\"\"))))))","v":"Lokaal mogelijk"},"Middelgrote dorpen en/of compacte wijken","Gestapelde bouw, rijwoningen, kleine apartementen",{"$f":"IF(Table1[[#This Row],[Type net]]=\"Individueel\",\"Ja\",\"Nee\")","v":"Nee"}]
["Thermische energie uit afvalwater - leidingen (TEA)​ LT","Warmtenet","Warmtenet - Thermische energie uit afvalwater - leidingen (TEA)​ LT","Centraal","S3e",10,"LT","Restwarmte uit afvalwaterleidingen wordt centraal benut en via het warmtenet verspreid. Dit systeem werkt op LT-niveau (25-40°C), maakt gebruik van een centrale warmtepomp en levert warmte via vloerverwarming, lage temperatuur radiatoren of convectoren.",{"$f":"IF(Table1[[#This Row],[Aflevertemperatuur]]=\"ZLT\",\"A-B\",IF(Table1[[#This Row],[Aflevertemperatuur]]=\"LT\",\"A-C\",IF(Table1[[#This Row],[Aflevertemperatuur]]=\"MT\",\"A-D\",IF(Table1[[#This Row],[Aflevertemperatuur]]=\"HT\",\"Alles\",IF(Table1[[#This Row],[Aflevertemperatuur]]=\"LT/MT\",\"A-D\")))))","v":"A-C"},{"$f":"IF(Table1[[#This Row],[Opwaardering]]=\"Decentraal\",\"Nee\",IF(Table1[[#This Row],[Opwaardering]]=\"N.v.t.\",\"Nee\",\"Ja\"))","v":"Ja"},"Middelhoge dichtheid","Middel",3,"Ja","Nee","Ja",{"$f":"IF(Table1[[#This Row],[Schaalgrootte]]=\"Middel\",\"Lokaal mogelijk\",IF(Table1[[#This Row],[Schaalgrootte]]=\"Zeer groot\",\"Samenwerking noodzakelijk\",IF(Table1[[#This Row],[Schaalgrootte]]=\"Klein\",\"Lokaal mogelijk\",IF(Table1[[#This Row],[Schaalgrootte]]=\"Middelgroot\",\"Mogelijk samenwerking nodig\",IF(Table1[[#This Row],[Schaalgrootte]]=\"Individueel\",\"N.v.t.\",IF(Table1[[#This Row],[Schaalgrootte]]=\"Groot\",\"Mogelijk samenwerking nodig\",\"\"))))))","v":"Lokaal mogelijk"},"Middelgrote dorpen en/of compacte wijken","Gestapelde bouw, rijwoningen, kleine apartementen",{"$f":"IF(Table1[[#This Row],[Type net]]=\"Individueel\",\"Ja\",\"Nee\")","v":"Nee"}]
["Thermische energie uit afvalwater - RWZI (TEA)","Bronnet","Bronnet - Thermische energie uit afvalwater - RWZI (TEA)","Decentraal","N.v.t.",10,"ZLT","Restwarmte uit afvalwater bij RWZI wordt via een warmtewisselaar en decentrale warmtepomp benut. Dit systeem werkt op ZLT-niveau (< 25°C), maakt gebruik van een decentraal warmtepomp en levert warmte via vloerverwarming of lage temperatuur radiatoren.",{"$f":"IF(Table1[[#This Row],[Aflevertemperatuur]]=\"ZLT\",\"A-B\",IF(Table1[[#This Row],[Aflevertemperatuur]]=\"LT\",\"A-C\",IF(Table1[[#This Row],[Aflevertemperatuur]]=\"MT\",\"A-D\",IF(Table1[[#This Row],[Aflevertemperatuur]]=\"HT\",\"Alles\",IF(Table1[[#This Row],[Aflevertemperatuur]]=\"LT/MT\",\"A-D\")))))","v":"A-B"},{"$f":"IF(Table1[[#This Row],[Opwaardering]]=\"Decentraal\",\"Nee\",IF(Table1[[#This Row],[Opwaardering]]=\"N.v.t.\",\"Nee\",\"Ja\"))","v":"Nee"},"Middelhoge dichtheid","Middel",4,"Ja","Nee","Ja",{"$f":"IF(Table1[[#This Row],[Schaalgrootte]]=\"Middel\",\"Lokaal mogelijk\",IF(Table1[[#This Row],[Schaalgrootte]]=\"Zeer groot\",\"Samenwerking noodzakelijk\",IF(Table1[[#This Row],[Schaalgrootte]]=\"Klein\",\"Lokaal mogelijk\",IF(Table1[[#This Row],[Schaalgrootte]]=\"Middelgroot\",\"Mogelijk samenwerking nodig\",IF(Table1[[#This Row],[Schaalgrootte]]=\"Individueel\",\"N.v.t.\",IF(Table1[[#This Row],[Schaalgrootte]]=\"Groot\",\"Mogelijk samenwerking nodig\",\"\"))))))","v":"Lokaal mogelijk"},"Middelgrote dorpen en/of compacte wijken","Gestapelde bouw, rijwoningen, kleine apartementen",{"$f":"IF(Table1[[#This Row],[Type net]]=\"Individueel\",\"Ja\",\"Nee\")","v":"Nee"}]
["Thermische energie uit afvalwater - RWZI (TEA)​ + WKO","Bronnet","Bronnet - Thermische energie uit afvalwater - RWZI (TEA)​ + WKO","Decentraal","N.v.t.",15,"ZLT","Restwarmte uit afvalwater bij RWZI wordt via een warmtewisselaar en decentrale warmtepomp benut. Dit systeem werkt op ZLT-niveau (< 25°C), maakt gebruik van een decentraal warmtepomp en levert warmte via vloerverwarming of lage temperatuur radiatoren.",{"$f":"IF(Table1[[#This Row],[Aflevertemperatuur]]=\"ZLT\",\"A-B\",IF(Table1[[#This Row],[Aflevertemperatuur]]=\"LT\",\"A-C\",IF(Table1[[#This Row],[Aflevertemperatuur]]=\"MT\",\"A-D\",IF(Table1[[#This Row],[Aflevertemperatuur]]=\"HT\",\"Alles\",IF(Table1[[#This Row],[Aflevertemperatuur]]=\"LT/MT\",\"A-D\")))))","v":"A-B"},{"$f":"IF(Table1[[#This Row],[Opwaardering]]=\"Decentraal\",\"Nee\",IF(Table1[[#This Row],[Opwaardering]]=\"N.v.t.\",\"Nee\",\"Ja\"))","v":"Nee"},"Middelhoge dichtheid","Middel",3,"Ja","Nee","Ja",{"$f":"IF(Table1[[#This Row],[Schaalgrootte]]=\"Middel\",\"Lokaal mogelijk\",IF(Table1[[#This Row],[Schaalgrootte]]=\"Zeer groot\",\"Samenwerking noodzakelijk\",IF(Table1[[#This Row],[Schaalgrootte]]=\"Klein\",\"Lokaal mogelijk\",IF(Table1[[#This Row],[Schaalgrootte]]=\"Middelgroot\",\"Mogelijk samenwerking nodig\",IF(Table1[[#This Row],[Schaalgrootte]]=\"Individueel\",\"N.v.t.\",IF(Table1[[#This Row],[Schaalgrootte]]=\"Groot\",\"Mogelijk samenwerking nodig\",\"\"))))))","v":"Lokaal mogelijk"},"Middelgrote dorpen en/of compacte wijken","Gestapelde bouw, rijwoningen, kleine apartementen",{"$f":"IF(Table1[[#This Row],[Type net]]=\"Individueel\",\"Ja\",\"Nee\")","v":"Nee"}]
["Thermische energie uit afvalwater - RWZI (TEA)​ LT","Warmtenet","Warmtenet - Thermische energie uit afvalwater - RWZI (TEA)​ LT","Centraal","S3e",10,"LT","Restwarmte uit RWZI wordt via een centrale warmtepomp aan het warmtenet geleverd Dit systeem werkt op LT-niveau (25-40°C), maakt gebruik van een centrale warmtepomp en levert warmte via vloerverwarming, lage temperatuur radiatoren of convectoren.",{"$f":"IF(Table1[[#This Row],[Aflevertemperatuur]]=\"ZLT\",\"A-B\",IF(Table1[[#This Row],[Aflevertemperatuur]]=\"LT\",\"A-C\",IF(Table1[[#This Row],[Aflevertemperatuur]]=\"MT\",\"A-D\",IF(Table1[[#This Row],[Aflevertemperatuur]]=\"HT\",\"Alles\",IF(Table1[[#This Row],[Aflevertemperatuur]]=\"LT/MT\",\"A-D\")))))","v":"A-C"},{"$f":"IF(Table1[[#This Row],[Opwaardering]]=\"Decentraal\",\"Nee\",IF(Table1[[#This Row],[Opwaardering]]=\"N.v.t.\",\"Nee\",\"Ja\"))","v":"Ja"},"Middelhoge dichtheid","Middel",3,"Ja","Nee","Ja",{"$f":"IF(Table1[[#This Row],[Schaalgrootte]]=\"Middel\",\"Lokaal mogelijk\",IF(Table1[[#This Row],[Schaalgrootte]]=\"Zeer groot\",\"Samenwerking noodzakelijk\",IF(Table1[[#This Row],[Schaalgrootte]]=\"Klein\",\"Lokaal mogelijk\",IF(Table1[[#This Row],[Schaalgrootte]]=\"Middelgroot\",\"Mogelijk samenwerking nodig\",IF(Table1[[#This Row],[Schaalgrootte]]=\"Individueel\",\"N.v.t.\",IF(Table1[[#This Row],[Schaalgrootte]]=\"Groot\",\"Mogelijk samenwerking nodig\",\"\"))))))","v":"Lokaal mogelijk"},"Middelgrote dorpen en/of compacte wijken","Gestapelde bouw, rijwoningen, kleine apartementen",{"$f":"IF(Table1[[#This Row],[Type net]]=\"Individueel\",\"Ja\",\"Nee\")","v":"Nee"}]
["Thermische energie uit afvalwater - RWZI (TEA)​ LT + WKO","Warmtenet","Warmtenet - Thermische energie uit afvalwater - RWZI (TEA)​ LT + WKO","Centraal","S3e",15,"LT","Restwarmte uit RWZI wordt via een centrale warmtepomp aan het warmtenet geleverd Dit systeem werkt op LT-niveau (25-40°C), maakt gebruik van een centrale warmtepomp en levert warmte via vloerverwarming, lage temperatuur radiatoren of convectoren.",{"$f":"IF(Table1[[#This Row],[Aflevertemperatuur]]=\"ZLT\",\"A-B\",IF(Table1[[#This Row],[Aflevertemperatuur]]=\"LT\",\"A-C\",IF(Table1[[#This Row],[Aflevertemperatuur]]=\"MT\",\"A-D\",IF(Table1[[#This Row],[Aflevertemperatuur]]=\"HT\",\"Alles\",IF(Table1[[#This Row],[Aflevertemperatuur]]=\"LT/MT\",\"A-D\")))))","v":"A-C"},{"$f":"IF(Table1[[#This Row],[Opwaardering]]=\"Decentraal\",\"Nee\",IF(Table1[[#This Row],[Opwaardering]]=\"N.v.t.\",\"Nee\",\"Ja\"))","v":"Ja"},"Middelhoge dichtheid","Middel",3,"Ja","Nee","Ja",{"$f":"IF(Table1[[#This Row],[Schaalgrootte]]=\"Middel\",\"Lokaal mogelijk\",IF(Table1[[#This Row],[Schaalgrootte]]=\"Zeer groot\",\"Samenwerking noodzakelijk\",IF(Table1[[#This Row],[Schaalgrootte]]=\"Klein\",\"Lokaal mogelijk\",IF(Table1[[#This Row],[Schaalgrootte]]=\"Middelgroot\",\"Mogelijk samenwerking nodig\",IF(Table1[[#This Row],[Schaalgrootte]]=\"Individueel\",\"N.v.t.\",IF(Table1[[#This Row],[Schaalgrootte]]=\"Groot\",\"Mogelijk samenwerking nodig\",\"\"))))))","v":"Lokaal mogelijk"},"Middelgrote dorpen en/of compacte wijken","Gestapelde bouw, rijwoningen, kleine apartementen",{"$f":"IF(Table1[[#This Row],[Type net]]=\"Individueel\",\"Ja\",\"Nee\")","v":"Nee"}]
["Thermische energie uit drinkwater (TED)","Bronnet",{"$f":"B34&\" - \"&A34","v":"Bronnet - Thermische energie uit drinkwater (TED)"},"Decentraal","N.v.t.",10,"ZLT","Drinkwaterleidingen leveren thermische energie via warmtewisselaars en decentrale warmtepompen. Dit systeem werkt op ZLT-niveau (< 25°C), maakt gebruik van een decentraal warmtepomp en levert warmte via vloerverwarming of lage temperatuur radiatoren.",{"$f":"IF(Table1[[#This Row],[Aflevertemperatuur]]=\"ZLT\",\"A-B\",IF(Table1[[#This Row],[Aflevertemperatuur]]=\"LT\",\"A-C\",IF(Table1[[#This Row],[Aflevertemperatuur]]=\"MT\",\"A-D\",IF(Table1[[#This Row],[Aflevertemperatuur]]=\"HT\",\"Alles\",IF(Table1[[#This Row],[Aflevertemperatuur]]=\"LT/MT\",\"A-D\")))))","v":"A-B"},{"$f":"IF(Table1[[#This Row],[Opwaardering]]=\"Decentraal\",\"Nee\",IF(Table1[[#This Row],[Opwaardering]]=\"N.v.t.\",\"Nee\",\"Ja\"))","v":"Nee"},"Middelhoge dichtheid","Middel",4,"Ja","Nee","Ja",{"$f":"IF(Table1[[#This Row],[Schaalgrootte]]=\"Middel\",\"Lokaal mogelijk\",IF(Table1[[#This Row],[Schaalgrootte]]=\"Zeer groot\",\"Samenwerking noodzakelijk\",IF(Table1[[#This Row],[Schaalgrootte]]=\"Klein\",\"Lokaal mogelijk\",IF(Table1[[#This Row],[Schaalgrootte]]=\"Middelgroot\",\"Mogelijk samenwerking nodig\",IF(Table1[[#This Row],[Schaalgrootte]]=\"Individueel\",\"N.v.t.\",IF(Table1[[#This Row],[Schaalgrootte]]=\"Groot\",\"Mogelijk samenwerking nodig\",\"\"))))))","v":"Lokaal mogelijk"},"Middelgrote dorpen en/of compacte wijken","Gestapelde bouw, rijwoningen, kleine apartementen",{"$f":"IF(Table1[[#This Row],[Type net]]=\"Individueel\",\"Ja\",\"Nee\")","v":"Nee"}]
["Thermische energie uit drinkwater (TED) + WKO","Bronnet","Bronnet - Thermische energie uit drinkwater (TED) + WKO","Decentraal","N.v.t.",15,"ZLT","Drinkwaterleidingen leveren thermische energie via warmtewisselaars en decentrale warmtepompen. Dit systeem werkt op ZLT-niveau (< 25°C), maakt gebruik van een decentraal warmtepomp en levert warmte via vloerverwarming of lage temperatuur radiatoren.",{"$f":"IF(Table1[[#This Row],[Aflevertemperatuur]]=\"ZLT\",\"A-B\",IF(Table1[[#This Row],[Aflevertemperatuur]]=\"LT\",\"A-C\",IF(Table1[[#This Row],[Aflevertemperatuur]]=\"MT\",\"A-D\",IF(Table1[[#This Row],[Aflevertemperatuur]]=\"HT\",\"Alles\",IF(Table1[[#This Row],[Aflevertemperatuur]]=\"LT/MT\",\"A-D\")))))","v":"A-B"},{"$f":"IF(Table1[[#This Row],[Opwaardering]]=\"Decentraal\",\"Nee\",IF(Table1[[#This Row],[Opwaardering]]=\"N.v.t.\",\"Nee\",\"Ja\"))","v":"Nee"},"Middelhoge dichtheid","Middel",3,"Ja","Nee","Ja",{"$f":"IF(Table1[[#This Row],[Schaalgrootte]]=\"Middel\",\"Lokaal mogelijk\",IF(Table1[[#This Row],[Schaalgrootte]]=\"Zeer groot\",\"Samenwerking noodzakelijk\",IF(Table1[[#This Row],[Schaalgrootte]]=\"Klein\",\"Lokaal mogelijk\",IF(Table1[[#This Row],[Schaalgrootte]]=\"Middelgroot\",\"Mogelijk samenwerking nodig\",IF(Table1[[#This Row],[Schaalgrootte]]=\"Individueel\",\"N.v.t.\",IF(Table1[[#This Row],[Schaalgrootte]]=\"Groot\",\"Mogelijk samenwerking nodig\",\"\"))))))","v":"Lokaal mogelijk"},"Middelgrote dorpen en/of compacte wijken","Gestapelde bouw, rijwoningen, kleine apartementen",{"$f":"IF(Table1[[#This Row],[Type net]]=\"Individueel\",\"Ja\",\"Nee\")","v":"Nee"}]
["Thermische energie uit drinkwater (TED)​ LT","Warmtenet","Warmtenet - Thermische energie uit drinkwater (TED)​ LT","Centraal","S3e",10,"LT","Drinkwaterleidingen leveren thermische energie aan een centrale warmtepomp, die via het warmtenet verspreidt. Dit systeem werkt op LT-niveau (25-40°C), maakt gebruik van een centrale warmtepomp en levert warmte via vloerverwarming, lage temperatuur radiatoren of convectoren.",{"$f":"IF(Table1[[#This Row],[Aflevertemperatuur]]=\"ZLT\",\"A-B\",IF(Table1[[#This Row],[Aflevertemperatuur]]=\"LT\",\"A-C\",IF(Table1[[#This Row],[Aflevertemperatuur]]=\"MT\",\"A-D\",IF(Table1[[#This Row],[Aflevertemperatuur]]=\"HT\",\"Alles\",IF(Table1[[#This Row],[Aflevertemperatuur]]=\"LT/MT\",\"A-D\")))))","v":"A-C"},{"$f":"IF(Table1[[#This Row],[Opwaardering]]=\"Decentraal\",\"Nee\",IF(Table1[[#This Row],[Opwaardering]]=\"N.v.t.\",\"Nee\",\"Ja\"))","v":"Ja"},"Middelhoge dichtheid","Middel",3,"Ja","Nee","Ja",{"$f":"IF(Table1[[#This Row],[Schaalgrootte]]=\"Middel\",\"Lokaal mogelijk\",IF(Table1[[#This Row],[Schaalgrootte]]=\"Zeer groot\",\"Samenwerking noodzakelijk\",IF(Table1[[#This Row],[Schaalgrootte]]=\"Klein\",\"Lokaal mogelijk\",IF(Table1[[#This Row],[Schaalgrootte]]=\"Middelgroot\",\"Mogelijk samenwerking nodig\",IF(Table1[[#This Row],[Schaalgrootte]]=\"Individueel\",\"N.v.t.\",IF(Table1[[#This Row],[Schaalgrootte]]=\"Groot\",\"Mogelijk samenwerking nodig\",\"\"))))))","v":"Lokaal mogelijk"},"Middelgrote dorpen en/of compacte wijken","Gestapelde bouw, rijwoningen, kleine apartementen",{"$f":"IF(Table1[[#This Row],[Type net]]=\"Individueel\",\"Ja\",\"Nee\")","v":"Nee"}]
["Thermische energie uit drinkwater (TED)​ LT + WKO","Warmtenet","Warmtenet - Thermische energie uit drinkwater (TED)​ LT + WKO","Centraal","S3e",15,"LT","Drinkwaterleidingen leveren thermische energie aan een centrale warmtepomp, die via het warmtenet verspreidt. Dit systeem werkt op LT-niveau (25-40°C), maakt gebruik van een centrale warmtepomp en levert warmte via vloerverwarming, lage temperatuur radiatoren of convectoren.",{"$f":"IF(Table1[[#This Row],[Aflevertemperatuur]]=\"ZLT\",\"A-B\",IF(Table1[[#This Row],[Aflevertemperatuur]]=\"LT\",\"A-C\",IF(Table1[[#This Row],[Aflevertemperatuur]]=\"MT\",\"A-D\",IF(Table1[[#This Row],[Aflevertemperatuur]]=\"HT\",\"Alles\",IF(Table1[[#This Row],[Aflevertemperatuur]]=\"LT/MT\",\"A-D\")))))","v":"A-C"},{"$f":"IF(Table1[[#This Row],[Opwaardering]]=\"Decentraal\",\"Nee\",IF(Table1[[#This Row],[Opwaardering]]=\"N.v.t.\",\"Nee\",\"Ja\"))","v":"Ja"},"Middelhoge dichtheid","Middel",3,"Ja","Nee","Ja",{"$f":"IF(Table1[[#This Row],[Schaalgrootte]]=\"Middel\",\"Lokaal mogelijk\",IF(Table1[[#This Row],[Schaalgrootte]]=\"Zeer groot\",\"Samenwerking noodzakelijk\",IF(Table1[[#This Row],[Schaalgrootte]]=\"Klein\",\"Lokaal mogelijk\",IF(Table1[[#This Row],[Schaalgrootte]]=\"Middelgroot\",\"Mogelijk samenwerking nodig\",IF(Table1[[#This Row],[Schaalgrootte]]=\"Individueel\",\"N.v.t.\",IF(Table1[[#This Row],[Schaalgrootte]]=\"Groot\",\"Mogelijk samenwerking nodig\",\"\"))))))","v":"Lokaal mogelijk"},"Middelgrote dorpen en/of compacte wijken","Gestapelde bouw, rijwoningen, kleine apartementen",{"$f":"IF(Table1[[#This Row],[Type net]]=\"Individueel\",\"Ja\",\"Nee\")","v":"Nee"}]
["Thermische energie uit oppervlaktewater (TEO)","Bronnet","Bronnet - Thermische energie uit oppervlaktewater (TEO)","Decentraal","N.v.t.",5,"ZLT","Warmte uit oppervlaktewater wordt via een warmtewisselaar en decentrale warmtepomp benut. Dit systeem werkt op ZLT-niveau (< 25°C), maakt gebruik van een decentraal warmtepomp en levert warmte via vloerverwarming of lage temperatuur radiatoren.",{"$f":"IF(Table1[[#This Row],[Aflevertemperatuur]]=\"ZLT\",\"A-B\",IF(Table1[[#This Row],[Aflevertemperatuur]]=\"LT\",\"A-C\",IF(Table1[[#This Row],[Aflevertemperatuur]]=\"MT\",\"A-D\",IF(Table1[[#This Row],[Aflevertemperatuur]]=\"HT\",\"Alles\",IF(Table1[[#This Row],[Aflevertemperatuur]]=\"LT/MT\",\"A-D\")))))","v":"A-B"},{"$f":"IF(Table1[[#This Row],[Opwaardering]]=\"Decentraal\",\"Nee\",IF(Table1[[#This Row],[Opwaardering]]=\"N.v.t.\",\"Nee\",\"Ja\"))","v":"Nee"},"Middelhoge dichtheid","Middel",5,"Ja","Nee","Ja",{"$f":"IF(Table1[[#This Row],[Schaalgrootte]]=\"Middel\",\"Lokaal mogelijk\",IF(Table1[[#This Row],[Schaalgrootte]]=\"Zeer groot\",\"Samenwerking noodzakelijk\",IF(Table1[[#This Row],[Schaalgrootte]]=\"Klein\",\"Lokaal mogelijk\",IF(Table1[[#This Row],[Schaalgrootte]]=\"Middelgroot\",\"Mogelijk samenwerking nodig\",IF(Table1[[#This Row],[Schaalgrootte]]=\"Individueel\",\"N.v.t.\",IF(Table1[[#This Row],[Schaalgrootte]]=\"Groot\",\"Mogelijk samenwerking nodig\",\"\"))))))","v":"Lokaal mogelijk"},"Middelgrote dorpen en/of compacte wijken","Gestapelde bouw, rijwoningen, kleine apartementen",{"$f":"IF(Table1[[#This Row],[Type net]]=\"Individueel\",\"Ja\",\"Nee\")","v":"Nee"}]
["Thermische energie uit oppervlaktewater (TEO)​ + WKO","Bronnet","Bronnet - Thermische energie uit oppervlaktewater (TEO)​ + WKO","Decentraal","N.v.t.",15,"ZLT","Warmte uit oppervlaktewater wordt via een warmtewisselaar en decentrale warmtepomp benut. Dit systeem werkt op ZLT-niveau (< 25°C), maakt gebruik van een decentraal warmtepomp en levert warmte via vloerverwarming of lage temperatuur radiatoren.",{"$f":"IF(Table1[[#This Row],[Aflevertemperatuur]]=\"ZLT\",\"A-B\",IF(Table1[[#This Row],[Aflevertemperatuur]]=\"LT\",\"A-C\",IF(Table1[[#This Row],[Aflevertemperatuur]]=\"MT\",\"A-D\",IF(Table1[[#This Row],[Aflevertemperatuur]]=\"HT\",\"Alles\",IF(Table1[[#This Row],[Aflevertemperatuur]]=\"LT/MT\",\"A-D\")))))","v":"A-B"},{"$f":"IF(Table1[[#This Row],[Opwaardering]]=\"Decentraal\",\"Nee\",IF(Table1[[#This Row],[Opwaardering]]=\"N.v.t.\",\"Nee\",\"Ja\"))","v":"Nee"},"Middelhoge dichtheid","Middel",3,"Ja","Nee","Ja",{"$f":"IF(Table1[[#This Row],[Schaalgrootte]]=\"Middel\",\"Lokaal mogelijk\",IF(Table1[[#This Row],[Schaalgrootte]]=\"Zeer groot\",\"Samenwerking noodzakelijk\",IF(Table1[[#This Row],[Schaalgrootte]]=\"Klein\",\"Lokaal mogelijk\",IF(Table1[[#This Row],[Schaalgrootte]]=\"Middelgroot\",\"Mogelijk samenwerking nodig\",IF(Table1[[#This Row],[Schaalgrootte]]=\"Individueel\",\"N.v.t.\",IF(Table1[[#This Row],[Schaalgrootte]]=\"Groot\",\"Mogelijk samenwerking nodig\",\"\"))))))","v":"Lokaal mogelijk"},"Middelgrote dorpen en/of compacte wijken","Gestapelde bouw, rijwoningen, kleine apartementen",{"$f":"IF(Table1[[#This Row],[Type net]]=\"Individueel\",\"Ja\",\"Nee\")","v":"Nee"}]
["Thermische energie uit oppervlaktewater (TEO)​ LT","Warmtenet","Warmtenet - Thermische energie uit oppervlaktewater (TEO)​ LT","Centraal","S3e",5,"LT","Oppervlaktewater levert warmte via een centrale warmtepomp aan het warmtenet. Dit systeem werkt op LT-niveau (25-40°C), maakt gebruik van een centrale warmtepomp en levert warmte via vloerverwarming, lage temperatuur radiatoren of convectoren.",{"$f":"IF(Table1[[#This Row],[Aflevertemperatuur]]=\"ZLT\",\"A-B\",IF(Table1[[#This Row],[Aflevertemperatuur]]=\"LT\",\"A-C\",IF(Table1[[#This Row],[Aflevertemperatuur]]=\"MT\",\"A-D\",IF(Table1[[#This Row],[Aflevertemperatuur]]=\"HT\",\"Alles\",IF(Table1[[#This Row],[Aflevertemperatuur]]=\"LT/MT\",\"A-D\")))))","v":"A-C"},{"$f":"IF(Table1[[#This Row],[Opwaardering]]=\"Decentraal\",\"Nee\",IF(Table1[[#This Row],[Opwaardering]]=\"N.v.t.\",\"Nee\",\"Ja\"))","v":"Ja"},"Middelhoge dichtheid","Middel",5,"Ja","Nee","Ja",{"$f":"IF(Table1[[#This Row],[Schaalgrootte]]=\"Middel\",\"Lokaal mogelijk\",IF(Table1[[#This Row],[Schaalgrootte]]=\"Zeer groot\",\"Samenwerking noodzakelijk\",IF(Table1[[#This Row],[Schaalgrootte]]=\"Klein\",\"Lokaal mogelijk\",IF(Table1[[#This Row],[Schaalgrootte]]=\"Middelgroot\",\"Mogelijk samenwerking nodig\",IF(Table1[[#This Row],[Schaalgrootte]]=\"Individueel\",\"N.v.t.\",IF(Table1[[#This Row],[Schaalgrootte]]=\"Groot\",\"Mogelijk samenwerking nodig\",\"\"))))))","v":"Lokaal mogelijk"},"Middelgrote dorpen en/of compacte wijken","Gestapelde bouw, rijwoningen, kleine apartementen",{"$f":"IF(Table1[[#This Row],[Type net]]=\"Individueel\",\"Ja\",\"Nee\")","v":"Nee"}]
["Thermische energie uit oppervlaktewater (TEO)​ LT + WKO","Warmtenet","Warmtenet - Thermische energie uit oppervlaktewater (TEO)​ LT + WKO","Centraal","S3e",15,"LT","Oppervlaktewater levert warmte via een centrale warmtepomp aan het warmtenet. Dit systeem werkt op LT-niveau (25-40°C), maakt gebruik van een centrale warmtepomp en levert warmte via vloerverwarming, lage temperatuur radiatoren of convectoren.",{"$f":"IF(Table1[[#This Row],[Aflevertemperatuur]]=\"ZLT\",\"A-B\",IF(Table1[[#This Row],[Aflevertemperatuur]]=\"LT\",\"A-C\",IF(Table1[[#This Row],[Aflevertemperatuur]]=\"MT\",\"A-D\",IF(Table1[[#This Row],[Aflevertemperatuur]]=\"HT\",\"Alles\",IF(Table1[[#This Row],[Aflevertemperatuur]]=\"LT/MT\",\"A-D\")))))","v":"A-C"},{"$f":"IF(Table1[[#This Row],[Opwaardering]]=\"Decentraal\",\"Nee\",IF(Table1[[#This Row],[Opwaardering]]=\"N.v.t.\",\"Nee\",\"Ja\"))","v":"Ja"},"Middelhoge dichtheid","Middel",3,"Ja","Nee","Ja",{"$f":"IF(Table1[[#This Row],[Schaalgrootte]]=\"Middel\",\"Lokaal mogelijk\",IF(Table1[[#This Row],[Schaalgrootte]]=\"Zeer groot\",\"Samenwerking noodzakelijk\",IF(Table1[[#This Row],[Schaalgrootte]]=\"Klein\",\"Lokaal mogelijk\",IF(Table1[[#This Row],[Schaalgrootte]]=\"Middelgroot\",\"Mogelijk samenwerking nodig\",IF(Table1[[#This Row],[Schaalgrootte]]=\"Individueel\",\"N.v.t.\",IF(Table1[[#This Row],[Schaalgrootte]]=\"Groot\",\"Mogelijk samenwerking nodig\",\"\"))))))","v":"Lokaal mogelijk"},"Middelgrote dorpen en/of compacte wijken","Gestapelde bouw, rijwoningen, kleine apartementen",{"$f":"IF(Table1[[#This Row],[Type net]]=\"Individueel\",\"Ja\",\"Nee\")","v":"Nee"}]
["Verbranden van houtige biomassa​","Warmtenet","Warmtenet - Verbranden van houtige biomassa​","N.v.t.","N.v.t.",150,"HT","Biomassa wordt verbrand in een centrale installatie. Hoge temperatuur warmte wordt via het warmtenet geleverd. Dit systeem werkt op HT-niveau (> 75°C), maakt gebruik van hoge temperatuur radiatoren of bestaande afgiftesystemen.",{"$f":"IF(Table1[[#This Row],[Aflevertemperatuur]]=\"ZLT\",\"A-B\",IF(Table1[[#This Row],[Aflevertemperatuur]]=\"LT\",\"A-C\",IF(Table1[[#This Row],[Aflevertemperatuur]]=\"MT\",\"A-D\",IF(Table1[[#This Row],[Aflevertemperatuur]]=\"HT\",\"Alles\",IF(Table1[[#This Row],[Aflevertemperatuur]]=\"LT/MT\",\"A-D\")))))","v":"Alles"},{"$f":"IF(Table1[[#This Row],[Opwaardering]]=\"Decentraal\",\"Nee\",IF(Table1[[#This Row],[Opwaardering]]=\"N.v.t.\",\"Nee\",\"Ja\"))","v":"Nee"},"Middelhoge dichtheid","Groot",1,"Ja","Ja","Nee",{"$f":"IF(Table1[[#This Row],[Schaalgrootte]]=\"Middel\",\"Lokaal mogelijk\",IF(Table1[[#This Row],[Schaalgrootte]]=\"Zeer groot\",\"Samenwerking noodzakelijk\",IF(Table1[[#This Row],[Schaalgrootte]]=\"Klein\",\"Lokaal mogelijk\",IF(Table1[[#This Row],[Schaalgrootte]]=\"Middelgroot\",\"Mogelijk samenwerking nodig\",IF(Table1[[#This Row],[Schaalgrootte]]=\"Individueel\",\"N.v.t.\",IF(Table1[[#This Row],[Schaalgrootte]]=\"Groot\",\"Mogelijk samenwerking nodig\",\"\"))))))","v":"Mogelijk samenwerking nodig"},"Middelgrote dorpen en/of compacte wijken","Gestapelde bouw, rijwoningen in stedelijke gebieden",{"$f":"IF(Table1[[#This Row],[Type net]]=\"Individueel\",\"Ja\",\"Nee\")","v":"Nee"}]
["Vergisting/vergassing afval​","Warmtenet","Warmtenet - Vergisting/vergassing afval​","Centraal","N.v.t.",50,"MT","Afval wordt vergist of vergast en verbrand, warmte wordt via het warmtenet geleverd. Dit systeem werkt op MT-niveau (40-75°C), maakt gebruik van radiatoren of convectoren.",{"$f":"IF(Table1[[#This Row],[Aflevertemperatuur]]=\"ZLT\",\"A-B\",IF(Table1[[#This Row],[Aflevertemperatuur]]=\"LT\",\"A-C\",IF(Table1[[#This Row],[Aflevertemperatuur]]=\"MT\",\"A-D\",IF(Table1[[#This Row],[Aflevertemperatuur]]=\"HT\",\"Alles\",IF(Table1[[#This Row],[Aflevertemperatuur]]=\"LT/MT\",\"A-D\")))))","v":"A-D"},{"$f":"IF(Table1[[#This Row],[Opwaardering]]=\"Decentraal\",\"Nee\",IF(Table1[[#This Row],[Opwaardering]]=\"N.v.t.\",\"Nee\",\"Ja\"))","v":"Ja"},"Middelhoge dichtheid","Groot",1,"Ja","Ja","Nee",{"$f":"IF(Table1[[#This Row],[Schaalgrootte]]=\"Middel\",\"Lokaal mogelijk\",IF(Table1[[#This Row],[Schaalgrootte]]=\"Zeer groot\",\"Samenwerking noodzakelijk\",IF(Table1[[#This Row],[Schaalgrootte]]=\"Klein\",\"Lokaal mogelijk\",IF(Table1[[#This Row],[Schaalgrootte]]=\"Middelgroot\",\"Mogelijk samenwerking nodig\",IF(Table1[[#This Row],[Schaalgrootte]]=\"Individueel\",\"N.v.t.\",IF(Table1[[#This Row],[Schaalgrootte]]=\"Groot\",\"Mogelijk samenwerking nodig\",\"\"))))))","v":"Mogelijk samenwerking nodig"},"Middelgrote dorpen en/of compacte wijken","Gestapelde bouw, rijwoningen in stedelijke gebieden",{"$f":"IF(Table1[[#This Row],[Type net]]=\"Individueel\",\"Ja\",\"Nee\")","v":"Nee"}]
["Warmte uit lokale restwarmte (supermarkten etc.)","Bronnet","Bronnet - Warmte uit lokale restwarmte (supermarkten etc.)","Decentraal","S3a",25,"LT","Restwarmte van lokale bronnen (zoals supermarkten) wordt via een bronnet en decentrale warmtepompen benut. Dit systeem werkt op LT-niveau (25-40°C), maakt gebruik van een decentraal warmtepomp en levert warmte via vloerverwarming of lage temperatuur radiatoren.",{"$f":"IF(Table1[[#This Row],[Aflevertemperatuur]]=\"ZLT\",\"A-B\",IF(Table1[[#This Row],[Aflevertemperatuur]]=\"LT\",\"A-C\",IF(Table1[[#This Row],[Aflevertemperatuur]]=\"MT\",\"A-D\",IF(Table1[[#This Row],[Aflevertemperatuur]]=\"HT\",\"Alles\",IF(Table1[[#This Row],[Aflevertemperatuur]]=\"LT/MT\",\"A-D\")))))","v":"A-C"},{"$f":"IF(Table1[[#This Row],[Opwaardering]]=\"Decentraal\",\"Nee\",IF(Table1[[#This Row],[Opwaardering]]=\"N.v.t.\",\"Nee\",\"Ja\"))","v":"Nee"},"Middelhoge dichtheid","Klein",2,"Ja","Nee","Nee",{"$f":"IF(Table1[[#This Row],[Schaalgrootte]]=\"Middel\",\"Lokaal mogelijk\",IF(Table1[[#This Row],[Schaalgrootte]]=\"Zeer groot\",\"Samenwerking noodzakelijk\",IF(Table1[[#This Row],[Schaalgrootte]]=\"Klein\",\"Lokaal mogelijk\",IF(Table1[[#This Row],[Schaalgrootte]]=\"Middelgroot\",\"Mogelijk samenwerking nodig\",IF(Table1[[#This Row],[Schaalgrootte]]=\"Individueel\",\"N.v.t.\",IF(Table1[[#This Row],[Schaalgrootte]]=\"Groot\",\"Mogelijk samenwerking nodig\",\"\"))))))","v":"Lokaal mogelijk"},"Middelgrote dorpen en/of compacte wijken","Appartementen nabij voorziening",{"$f":"IF(Table1[[#This Row],[Type net]]=\"Individueel\",\"Ja\",\"Nee\")","v":"Nee"}]
["Zonthermische panelen","Bronnet","Bronnet - Zonthermische panelen","Decentraal","N.v.t.",70,"MT","Zonthermische energie wordt via panelen en een buffervat geleverd aan decentrale warmtepompen. Dit systeem werkt op MT-niveau (40-75°C), maakt gebruik van een decentraal warmtepomp en levert warmte via radiatoren of convectoren.",{"$f":"IF(Table1[[#This Row],[Aflevertemperatuur]]=\"ZLT\",\"A-B\",IF(Table1[[#This Row],[Aflevertemperatuur]]=\"LT\",\"A-C\",IF(Table1[[#This Row],[Aflevertemperatuur]]=\"MT\",\"A-D\",IF(Table1[[#This Row],[Aflevertemperatuur]]=\"HT\",\"Alles\",IF(Table1[[#This Row],[Aflevertemperatuur]]=\"LT/MT\",\"A-D\")))))","v":"A-D"},{"$f":"IF(Table1[[#This Row],[Opwaardering]]=\"Decentraal\",\"Nee\",IF(Table1[[#This Row],[Opwaardering]]=\"N.v.t.\",\"Nee\",\"Ja\"))","v":"Nee"},"Middelhoge dichtheid","Middelgroot",3,"Nee","Nee","Nee",{"$f":"IF(Table1[[#This Row],[Schaalgrootte]]=\"Middel\",\"Lokaal mogelijk\",IF(Table1[[#This Row],[Schaalgrootte]]=\"Zeer groot\",\"Samenwerking noodzakelijk\",IF(Table1[[#This Row],[Schaalgrootte]]=\"Klein\",\"Lokaal mogelijk\",IF(Table1[[#This Row],[Schaalgrootte]]=\"Middelgroot\",\"Mogelijk samenwerking nodig\",IF(Table1[[#This Row],[Schaalgrootte]]=\"Individueel\",\"N.v.t.\",IF(Table1[[#This Row],[Schaalgrootte]]=\"Groot\",\"Mogelijk samenwerking nodig\",\"\"))))))","v":"Mogelijk samenwerking nodig"},"Middelgrote dorpen en/of compacte wijken","Gestapelde bouw, rijwoningen, kleine apartementen",{"$f":"IF(Table1[[#This Row],[Type net]]=\"Individueel\",\"Ja\",\"Nee\")","v":"Nee"}]
["Zonthermische panelen","Warmtenet","Warmtenet - Zonthermische panelen","Centraal","N.v.t.",70,"MT","Zonthermische energie wordt centraal opgeslagen en via het warmtenet geleverd. Dit systeem werkt op MT-niveau (40-75°C), maakt gebruik van een centrale warmtepomp en levert warmte via radiatoren of convectoren.",{"$f":"IF(Table1[[#This Row],[Aflevertemperatuur]]=\"ZLT\",\"A-B\",IF(Table1[[#This Row],[Aflevertemperatuur]]=\"LT\",\"A-C\",IF(Table1[[#This Row],[Aflevertemperatuur]]=\"MT\",\"A-D\",IF(Table1[[#This Row],[Aflevertemperatuur]]=\"HT\",\"Alles\",IF(Table1[[#This Row],[Aflevertemperatuur]]=\"LT/MT\",\"A-D\")))))","v":"A-D"},{"$f":"IF(Table1[[#This Row],[Opwaardering]]=\"Decentraal\",\"Nee\",IF(Table1[[#This Row],[Opwaardering]]=\"N.v.t.\",\"Nee\",\"Ja\"))","v":"Ja"},"Middelhoge dichtheid","Middelgroot",3,"Nee","Nee","Nee",{"$f":"IF(Table1[[#This Row],[Schaalgrootte]]=\"Middel\",\"Lokaal mogelijk\",IF(Table1[[#This Row],[Schaalgrootte]]=\"Zeer groot\",\"Samenwerking noodzakelijk\",IF(Table1[[#This Row],[Schaalgrootte]]=\"Klein\",\"Lokaal mogelijk\",IF(Table1[[#This Row],[Schaalgrootte]]=\"Middelgroot\",\"Mogelijk samenwerking nodig\",IF(Table1[[#This Row],[Schaalgrootte]]=\"Individueel\",\"N.v.t.\",IF(Table1[[#This Row],[Schaalgrootte]]=\"Groot\",\"Mogelijk samenwerking nodig\",\"\"))))))","v":"Mogelijk samenwerking nodig"},"Middelgrote dorpen en/of compacte wijken","Gestapelde bouw, rijwoningen, kleine apartementen",{"$f":"IF(Table1[[#This Row],[Type net]]=\"Individueel\",\"Ja\",\"Nee\")","v":"Nee"}]
["Zonthermische panelen + HTO","Warmtenet","Warmtenet - Zonthermische panelen + HTO","Centraal","N.v.t.",55,"MT","Zonthermische energie wordt opgeslagen in HTO en via het warmtenet geleverd. Dit systeem werkt op MT-niveau (40-75°C), maakt gebruik van een centrale warmtepomp en levert warmte via radiatoren of convectoren.",{"$f":"IF(Table1[[#This Row],[Aflevertemperatuur]]=\"ZLT\",\"A-B\",IF(Table1[[#This Row],[Aflevertemperatuur]]=\"LT\",\"A-C\",IF(Table1[[#This Row],[Aflevertemperatuur]]=\"MT\",\"A-D\",IF(Table1[[#This Row],[Aflevertemperatuur]]=\"HT\",\"Alles\",IF(Table1[[#This Row],[Aflevertemperatuur]]=\"LT/MT\",\"A-D\")))))","v":"A-D"},"Nee","Middelhoge dichtheid","Middelgroot",3,"Nee","Nee","Ja",{"$f":"IF(Table1[[#This Row],[Schaalgrootte]]=\"Middel\",\"Lokaal mogelijk\",IF(Table1[[#This Row],[Schaalgrootte]]=\"Zeer groot\",\"Samenwerking noodzakelijk\",IF(Table1[[#This Row],[Schaalgrootte]]=\"Klein\",\"Lokaal mogelijk\",IF(Table1[[#This Row],[Schaalgrootte]]=\"Middelgroot\",\"Mogelijk samenwerking nodig\",IF(Table1[[#This Row],[Schaalgrootte]]=\"Individueel\",\"N.v.t.\",IF(Table1[[#This Row],[Schaalgrootte]]=\"Groot\",\"Mogelijk samenwerking nodig\",\"\"))))))","v":"Mogelijk samenwerking nodig"},"Middelgrote dorpen en/of compacte wijken","Gestapelde bouw, rijwoningen, kleine apartementen",{"$f":"IF(Table1[[#This Row],[Type net]]=\"Individueel\",\"Ja\",\"Nee\")","v":"Nee"}]
["Gesloten bodemenergie​ MT","Warmtenet","Warmtenet - Gesloten bodemenergie​ MT","Centraal","S3d",10,"MT","Gesloten bodemlussen leveren warmte aan een centrale warmtepomp, die via een warmtenet verspreidt. Dit systeem werkt op MT-niveau (40-75°C), maakt gebruik van een centrale warmtepomp en levert warmte via vloerverwarming, lage temperatuur radiatoren of convectoren.",{"$f":"IF(Table1[[#This Row],[Aflevertemperatuur]]=\"ZLT\",\"A-B\",IF(Table1[[#This Row],[Aflevertemperatuur]]=\"LT\",\"A-C\",IF(Table1[[#This Row],[Aflevertemperatuur]]=\"MT\",\"A-D\",IF(Table1[[#This Row],[Aflevertemperatuur]]=\"HT\",\"Alles\",IF(Table1[[#This Row],[Aflevertemperatuur]]=\"LT/MT\",\"A-D\")))))","v":"A-D"},{"$f":"IF(Table1[[#This Row],[Opwaardering]]=\"Decentraal\",\"Nee\",IF(Table1[[#This Row],[Opwaardering]]=\"N.v.t.\",\"Nee\",\"Ja\"))","v":"Ja"},"Middelhoge dichtheid","Klein",4,"Ja","Nee","Ja",{"$f":"IF(Table1[[#This Row],[Schaalgrootte]]=\"Middel\",\"Lokaal mogelijk\",IF(Table1[[#This Row],[Schaalgrootte]]=\"Zeer groot\",\"Samenwerking noodzakelijk\",IF(Table1[[#This Row],[Schaalgrootte]]=\"Klein\",\"Lokaal mogelijk\",IF(Table1[[#This Row],[Schaalgrootte]]=\"Middelgroot\",\"Mogelijk samenwerking nodig\",IF(Table1[[#This Row],[Schaalgrootte]]=\"Individueel\",\"N.v.t.\",IF(Table1[[#This Row],[Schaalgrootte]]=\"Groot\",\"Mogelijk samenwerking nodig\",\"\"))))))","v":"Lokaal mogelijk"},"Middelgrote dorpen en/of compacte wijken","Gestapelde bouw, rijwoningen, kleine apartementen",{"$f":"IF(Table1[[#This Row],[Type net]]=\"Individueel\",\"Ja\",\"Nee\")","v":"Nee"}]
["Sportveld thermie MT (met WKO)","Warmtenet","Warmtenet - Sportveld thermie MT (met WKO)","Centraal","S3d",15,"MT","Sportvelden leveren warmte aan een WKO-buffer, dat via een centrale warmtepomp in het warmtenet wordt verspreid. Dit systeem werkt op MT-niveau (40-75°C), maakt gebruik van een centrale warmtepomp en levert warmte via vloerverwarming, lage temperatuur radiatoren of convectoren.",{"$f":"IF(Table1[[#This Row],[Aflevertemperatuur]]=\"ZLT\",\"A-B\",IF(Table1[[#This Row],[Aflevertemperatuur]]=\"LT\",\"A-C\",IF(Table1[[#This Row],[Aflevertemperatuur]]=\"MT\",\"A-D\",IF(Table1[[#This Row],[Aflevertemperatuur]]=\"HT\",\"Alles\",IF(Table1[[#This Row],[Aflevertemperatuur]]=\"LT/MT\",\"A-D\")))))","v":"A-D"},{"$f":"IF(Table1[[#This Row],[Opwaardering]]=\"Decentraal\",\"Nee\",IF(Table1[[#This Row],[Opwaardering]]=\"N.v.t.\",\"Nee\",\"Ja\"))","v":"Ja"},"Middelhoge dichtheid","Middel",5,"Ja","Nee","Ja",{"$f":"IF(Table1[[#This Row],[Schaalgrootte]]=\"Middel\",\"Lokaal mogelijk\",IF(Table1[[#This Row],[Schaalgrootte]]=\"Zeer groot\",\"Samenwerking noodzakelijk\",IF(Table1[[#This Row],[Schaalgrootte]]=\"Klein\",\"Lokaal mogelijk\",IF(Table1[[#This Row],[Schaalgrootte]]=\"Middelgroot\",\"Mogelijk samenwerking nodig\",IF(Table1[[#This Row],[Schaalgrootte]]=\"Individueel\",\"N.v.t.\",IF(Table1[[#This Row],[Schaalgrootte]]=\"Groot\",\"Mogelijk samenwerking nodig\",\"\"))))))","v":"Lokaal mogelijk"},"Middelgrote dorpen en/of compacte wijken","Wijken nabij sportvelden",{"$f":"IF(Table1[[#This Row],[Type net]]=\"Individueel\",\"Ja\",\"Nee\")","v":"Nee"}]
["Thermische energie uit afvalwater - leidingen (TEA)​ MT","Warmtenet","Warmtenet - Thermische energie uit afvalwater - leidingen (TEA)​ MT","Centraal","S3e",10,"MT","Restwarmte uit afvalwaterleidingen wordt centraal benut en via het warmtenet verspreid. Dit systeem werkt op MT-niveau (40-75°C), maakt gebruik van een centrale warmtepomp en levert warmte via vloerverwarming, lage temperatuur radiatoren of convectoren.",{"$f":"IF(Table1[[#This Row],[Aflevertemperatuur]]=\"ZLT\",\"A-B\",IF(Table1[[#This Row],[Aflevertemperatuur]]=\"LT\",\"A-C\",IF(Table1[[#This Row],[Aflevertemperatuur]]=\"MT\",\"A-D\",IF(Table1[[#This Row],[Aflevertemperatuur]]=\"HT\",\"Alles\",IF(Table1[[#This Row],[Aflevertemperatuur]]=\"LT/MT\",\"A-D\")))))","v":"A-D"},{"$f":"IF(Table1[[#This Row],[Opwaardering]]=\"Decentraal\",\"Nee\",IF(Table1[[#This Row],[Opwaardering]]=\"N.v.t.\",\"Nee\",\"Ja\"))","v":"Ja"},"Middelhoge dichtheid","Middel",4,"Ja","Nee","Ja",{"$f":"IF(Table1[[#This Row],[Schaalgrootte]]=\"Middel\",\"Lokaal mogelijk\",IF(Table1[[#This Row],[Schaalgrootte]]=\"Zeer groot\",\"Samenwerking noodzakelijk\",IF(Table1[[#This Row],[Schaalgrootte]]=\"Klein\",\"Lokaal mogelijk\",IF(Table1[[#This Row],[Schaalgrootte]]=\"Middelgroot\",\"Mogelijk samenwerking nodig\",IF(Table1[[#This Row],[Schaalgrootte]]=\"Individueel\",\"N.v.t.\",IF(Table1[[#This Row],[Schaalgrootte]]=\"Groot\",\"Mogelijk samenwerking nodig\",\"\"))))))","v":"Lokaal mogelijk"},"Middelgrote dorpen en/of compacte wijken","Gestapelde bouw, rijwoningen, kleine apartementen",{"$f":"IF(Table1[[#This Row],[Type net]]=\"Individueel\",\"Ja\",\"Nee\")","v":"Nee"}]
["Thermische energie uit afvalwater - RWZI (TEA)​ MT","Warmtenet","Warmtenet - Thermische energie uit afvalwater - RWZI (TEA)​ MT","Centraal","S3e",10,"MT","Restwarmte uit RWZI wordt via een centrale warmtepomp aan het warmtenet geleverd Dit systeem werkt op MT-niveau (40-75°C), maakt gebruik van een centrale warmtepomp en levert warmte via vloerverwarming, lage temperatuur radiatoren of convectoren.",{"$f":"IF(Table1[[#This Row],[Aflevertemperatuur]]=\"ZLT\",\"A-B\",IF(Table1[[#This Row],[Aflevertemperatuur]]=\"LT\",\"A-C\",IF(Table1[[#This Row],[Aflevertemperatuur]]=\"MT\",\"A-D\",IF(Table1[[#This Row],[Aflevertemperatuur]]=\"HT\",\"Alles\",IF(Table1[[#This Row],[Aflevertemperatuur]]=\"LT/MT\",\"A-D\")))))","v":"A-D"},{"$f":"IF(Table1[[#This Row],[Opwaardering]]=\"Decentraal\",\"Nee\",IF(Table1[[#This Row],[Opwaardering]]=\"N.v.t.\",\"Nee\",\"Ja\"))","v":"Ja"},"Middelhoge dichtheid","Middel",4,"Ja","Nee","Ja",{"$f":"IF(Table1[[#This Row],[Schaalgrootte]]=\"Middel\",\"Lokaal mogelijk\",IF(Table1[[#This Row],[Schaalgrootte]]=\"Zeer groot\",\"Samenwerking noodzakelijk\",IF(Table1[[#This Row],[Schaalgrootte]]=\"Klein\",\"Lokaal mogelijk\",IF(Table1[[#This Row],[Schaalgrootte]]=\"Middelgroot\",\"Mogelijk samenwerking nodig\",IF(Table1[[#This Row],[Schaalgrootte]]=\"Individueel\",\"N.v.t.\",IF(Table1[[#This Row],[Schaalgrootte]]=\"Groot\",\"Mogelijk samenwerking nodig\",\"\"))))))","v":"Lokaal mogelijk"},"Middelgrote dorpen en/of compacte wijken","Gestapelde bouw, rijwoningen, kleine apartementen",{"$f":"IF(Table1[[#This Row],[Type net]]=\"Individueel\",\"Ja\",\"Nee\")","v":"Nee"}]
["Thermische energie uit afvalwater - RWZI (TEA)​ MT + WKO","Warmtenet","Warmtenet - Thermische energie uit afvalwater - RWZI (TEA)​ MT + WKO","Centraal","S3e",15,"MT","Restwarmte uit RWZI wordt via een centrale warmtepomp aan het warmtenet geleverd Dit systeem werkt op MT-niveau (40-75°C), maakt gebruik van een centrale warmtepomp en levert warmte via vloerverwarming, lage temperatuur radiatoren of convectoren.",{"$f":"IF(Table1[[#This Row],[Aflevertemperatuur]]=\"ZLT\",\"A-B\",IF(Table1[[#This Row],[Aflevertemperatuur]]=\"LT\",\"A-C\",IF(Table1[[#This Row],[Aflevertemperatuur]]=\"MT\",\"A-D\",IF(Table1[[#This Row],[Aflevertemperatuur]]=\"HT\",\"Alles\",IF(Table1[[#This Row],[Aflevertemperatuur]]=\"LT/MT\",\"A-D\")))))","v":"A-D"},{"$f":"IF(Table1[[#This Row],[Opwaardering]]=\"Decentraal\",\"Nee\",IF(Table1[[#This Row],[Opwaardering]]=\"N.v.t.\",\"Nee\",\"Ja\"))","v":"Ja"},"Middelhoge dichtheid","Middel",4,"Ja","Nee","Ja",{"$f":"IF(Table1[[#This Row],[Schaalgrootte]]=\"Middel\",\"Lokaal mogelijk\",IF(Table1[[#This Row],[Schaalgrootte]]=\"Zeer groot\",\"Samenwerking noodzakelijk\",IF(Table1[[#This Row],[Schaalgrootte]]=\"Klein\",\"Lokaal mogelijk\",IF(Table1[[#This Row],[Schaalgrootte]]=\"Middelgroot\",\"Mogelijk samenwerking nodig\",IF(Table1[[#This Row],[Schaalgrootte]]=\"Individueel\",\"N.v.t.\",IF(Table1[[#This Row],[Schaalgrootte]]=\"Groot\",\"Mogelijk samenwerking nodig\",\"\"))))))","v":"Lokaal mogelijk"},"Middelgrote dorpen en/of compacte wijken","Gestapelde bouw, rijwoningen, kleine apartementen",{"$f":"IF(Table1[[#This Row],[Type net]]=\"Individueel\",\"Ja\",\"Nee\")","v":"Nee"}]
["Thermische energie uit drinkwater (TED)​ MT","Warmtenet","Warmtenet - Thermische energie uit drinkwater (TED)​ MT","Centraal","S3e",10,"MT","Drinkwaterleidingen leveren thermische energie aan een centrale warmtepomp, die via het warmtenet verspreidt. Dit systeem werkt op MT-niveau (40-75°C), maakt gebruik van een centrale warmtepomp en levert warmte via vloerverwarming, lage temperatuur radiatoren of convectoren.",{"$f":"IF(Table1[[#This Row],[Aflevertemperatuur]]=\"ZLT\",\"A-B\",IF(Table1[[#This Row],[Aflevertemperatuur]]=\"LT\",\"A-C\",IF(Table1[[#This Row],[Aflevertemperatuur]]=\"MT\",\"A-D\",IF(Table1[[#This Row],[Aflevertemperatuur]]=\"HT\",\"Alles\",IF(Table1[[#This Row],[Aflevertemperatuur]]=\"LT/MT\",\"A-D\")))))","v":"A-D"},{"$f":"IF(Table1[[#This Row],[Opwaardering]]=\"Decentraal\",\"Nee\",IF(Table1[[#This Row],[Opwaardering]]=\"N.v.t.\",\"Nee\",\"Ja\"))","v":"Ja"},"Middelhoge dichtheid","Middel",4,"Ja","Nee","Ja",{"$f":"IF(Table1[[#This Row],[Schaalgrootte]]=\"Middel\",\"Lokaal mogelijk\",IF(Table1[[#This Row],[Schaalgrootte]]=\"Zeer groot\",\"Samenwerking noodzakelijk\",IF(Table1[[#This Row],[Schaalgrootte]]=\"Klein\",\"Lokaal mogelijk\",IF(Table1[[#This Row],[Schaalgrootte]]=\"Middelgroot\",\"Mogelijk samenwerking nodig\",IF(Table1[[#This Row],[Schaalgrootte]]=\"Individueel\",\"N.v.t.\",IF(Table1[[#This Row],[Schaalgrootte]]=\"Groot\",\"Mogelijk samenwerking nodig\",\"\"))))))","v":"Lokaal mogelijk"},"Middelgrote dorpen en/of compacte wijken","Gestapelde bouw, rijwoningen, kleine apartementen",{"$f":"IF(Table1[[#This Row],[Type net]]=\"Individueel\",\"Ja\",\"Nee\")","v":"Nee"}]
["Thermische energie uit drinkwater (TED)​ MT + WKO","Warmtenet","Warmtenet - Thermische energie uit drinkwater (TED)​ MT + WKO","Centraal","S3e",15,"MT","Drinkwaterleidingen leveren thermische energie aan een centrale warmtepomp, die via het warmtenet verspreidt. Dit systeem werkt op MT-niveau (40-75°C), maakt gebruik van een centrale warmtepomp en levert warmte via vloerverwarming, lage temperatuur radiatoren of convectoren.",{"$f":"IF(Table1[[#This Row],[Aflevertemperatuur]]=\"ZLT\",\"A-B\",IF(Table1[[#This Row],[Aflevertemperatuur]]=\"LT\",\"A-C\",IF(Table1[[#This Row],[Aflevertemperatuur]]=\"MT\",\"A-D\",IF(Table1[[#This Row],[Aflevertemperatuur]]=\"HT\",\"Alles\",IF(Table1[[#This Row],[Aflevertemperatuur]]=\"LT/MT\",\"A-D\")))))","v":"A-D"},{"$f":"IF(Table1[[#This Row],[Opwaardering]]=\"Decentraal\",\"Nee\",IF(Table1[[#This Row],[Opwaardering]]=\"N.v.t.\",\"Nee\",\"Ja\"))","v":"Ja"},"Middelhoge dichtheid","Middel",4,"Ja","Nee","Ja",{"$f":"IF(Table1[[#This Row],[Schaalgrootte]]=\"Middel\",\"Lokaal mogelijk\",IF(Table1[[#This Row],[Schaalgrootte]]=\"Zeer groot\",\"Samenwerking noodzakelijk\",IF(Table1[[#This Row],[Schaalgrootte]]=\"Klein\",\"Lokaal mogelijk\",IF(Table1[[#This Row],[Schaalgrootte]]=\"Middelgroot\",\"Mogelijk samenwerking nodig\",IF(Table1[[#This Row],[Schaalgrootte]]=\"Individueel\",\"N.v.t.\",IF(Table1[[#This Row],[Schaalgrootte]]=\"Groot\",\"Mogelijk samenwerking nodig\",\"\"))))))","v":"Lokaal mogelijk"},"Middelgrote dorpen en/of compacte wijken","Gestapelde bouw, rijwoningen, kleine apartementen",{"$f":"IF(Table1[[#This Row],[Type net]]=\"Individueel\",\"Ja\",\"Nee\")","v":"Nee"}]
["Thermische energie uit oppervlaktewater (TEO)​ MT","Warmtenet","Warmtenet - Thermische energie uit oppervlaktewater (TEO)​ MT","Centraal","S3e",5,"MT","Oppervlaktewater levert warmte via een centrale warmtepomp aan het warmtenet. Dit systeem werkt op MT-niveau (40-75°C), maakt gebruik van een centrale warmtepomp en levert warmte via vloerverwarming, lage temperatuur radiatoren of convectoren.",{"$f":"IF(Table1[[#This Row],[Aflevertemperatuur]]=\"ZLT\",\"A-B\",IF(Table1[[#This Row],[Aflevertemperatuur]]=\"LT\",\"A-C\",IF(Table1[[#This Row],[Aflevertemperatuur]]=\"MT\",\"A-D\",IF(Table1[[#This Row],[Aflevertemperatuur]]=\"HT\",\"Alles\",IF(Table1[[#This Row],[Aflevertemperatuur]]=\"LT/MT\",\"A-D\")))))","v":"A-D"},{"$f":"IF(Table1[[#This Row],[Opwaardering]]=\"Decentraal\",\"Nee\",IF(Table1[[#This Row],[Opwaardering]]=\"N.v.t.\",\"Nee\",\"Ja\"))","v":"Ja"},"Middelhoge dichtheid","Middel",5,"Ja","Nee","Ja",{"$f":"IF(Table1[[#This Row],[Schaalgrootte]]=\"Middel\",\"Lokaal mogelijk\",IF(Table1[[#This Row],[Schaalgrootte]]=\"Zeer groot\",\"Samenwerking noodzakelijk\",IF(Table1[[#This Row],[Schaalgrootte]]=\"Klein\",\"Lokaal mogelijk\",IF(Table1[[#This Row],[Schaalgrootte]]=\"Middelgroot\",\"Mogelijk samenwerking nodig\",IF(Table1[[#This Row],[Schaalgrootte]]=\"Individueel\",\"N.v.t.\",IF(Table1[[#This Row],[Schaalgrootte]]=\"Groot\",\"Mogelijk samenwerking nodig\",\"\"))))))","v":"Lokaal mogelijk"},"Middelgrote dorpen en/of compacte wijken","Gestapelde bouw, rijwoningen, kleine apartementen",{"$f":"IF(Table1[[#This Row],[Type net]]=\"Individueel\",\"Ja\",\"Nee\")","v":"Nee"}]
["Thermische energie uit oppervlaktewater (TEO)​ MT + WKO","Warmtenet","Warmtenet - Thermische energie uit oppervlaktewater (TEO)​ MT + WKO","Centraal","S3e",15,"MT","Oppervlaktewater levert warmte via een centrale warmtepomp aan het warmtenet. Dit systeem werkt op MT-niveau (40-75°C), maakt gebruik van een centrale warmtepomp en levert warmte via vloerverwarming, lage temperatuur radiatoren of convectoren.",{"$f":"IF(Table1[[#This Row],[Aflevertemperatuur]]=\"ZLT\",\"A-B\",IF(Table1[[#This Row],[Aflevertemperatuur]]=\"LT\",\"A-C\",IF(Table1[[#This Row],[Aflevertemperatuur]]=\"MT\",\"A-D\",IF(Table1[[#This Row],[Aflevertemperatuur]]=\"HT\",\"Alles\",IF(Table1[[#This Row],[Aflevertemperatuur]]=\"LT/MT\",\"A-D\")))))","v":"A-D"},{"$f":"IF(Table1[[#This Row],[Opwaardering]]=\"Decentraal\",\"Nee\",IF(Table1[[#This Row],[Opwaardering]]=\"N.v.t.\",\"Nee\",\"Ja\"))","v":"Ja"},"Middelhoge dichtheid","Middel",4,"Ja","Nee","Ja",{"$f":"IF(Table1[[#This Row],[Schaalgrootte]]=\"Middel\",\"Lokaal mogelijk\",IF(Table1[[#This Row],[Schaalgrootte]]=\"Zeer groot\",\"Samenwerking noodzakelijk\",IF(Table1[[#This Row],[Schaalgrootte]]=\"Klein\",\"Lokaal mogelijk\",IF(Table1[[#This Row],[Schaalgrootte]]=\"Middelgroot\",\"Mogelijk samenwerking nodig\",IF(Table1[[#This Row],[Schaalgrootte]]=\"Individueel\",\"N.v.t.\",IF(Table1[[#This Row],[Schaalgrootte]]=\"Groot\",\"Mogelijk samenwerking nodig\",\"\"))))))","v":"Lokaal mogelijk"},"Middelgrote dorpen en/of compacte wijken","Gestapelde bouw, rijwoningen, kleine apartementen",{"$f":"IF(Table1[[#This Row],[Type net]]=\"Individueel\",\"Ja\",\"Nee\")","v":"Nee"}]
["Collectieve lucht-water warmtepomp","Warmtenet","Warmtenet - Collectieve lucht-water warmtepomp","Centraal","N.v.t.",7.5,"MT","Een nabijgelegen bron zoals aquathermie en geothermie leveren warmte via een collectieve lucht-water warmtepomp aan het warmtenet. (BES) Dit systeem werkt op middeltemperatuur (45–75°C), maakt gebruik van een centrale warmtepompinstallatie en levert warmte aan woningen via convectoren.",{"$f":"IF(Table1[[#This Row],[Aflevertemperatuur]]=\"ZLT\",\"A-B\",IF(Table1[[#This Row],[Aflevertemperatuur]]=\"LT\",\"A-C\",IF(Table1[[#This Row],[Aflevertemperatuur]]=\"MT\",\"A-D\",IF(Table1[[#This Row],[Aflevertemperatuur]]=\"HT\",\"Alles\",IF(Table1[[#This Row],[Aflevertemperatuur]]=\"LT/MT\",\"A-D\")))))","v":"A-D"},{"$f":"IF(Table1[[#This Row],[Opwaardering]]=\"Decentraal\",\"Nee\",IF(Table1[[#This Row],[Opwaardering]]=\"N.v.t.\",\"Nee\",\"Ja\"))","v":"Ja"},"Middelhoge dichtheid","Middel",5,"Ja","Nee","Mogelijk",{"$f":"IF(Table1[[#This Row],[Schaalgrootte]]=\"Middel\",\"Lokaal mogelijk\",IF(Table1[[#This Row],[Schaalgrootte]]=\"Zeer groot\",\"Samenwerking noodzakelijk\",IF(Table1[[#This Row],[Schaalgrootte]]=\"Klein\",\"Lokaal mogelijk\",IF(Table1[[#This Row],[Schaalgrootte]]=\"Middelgroot\",\"Mogelijk samenwerking nodig\",IF(Table1[[#This Row],[Schaalgrootte]]=\"Individueel\",\"N.v.t.\",IF(Table1[[#This Row],[Schaalgrootte]]=\"Groot\",\"Mogelijk samenwerking nodig\",\"\"))))))","v":"Lokaal mogelijk"},"Middelgrote dorpen en/of compacte wijken","Gestapelde bouw, rijwoningen, kleine apartementen",{"$f":"IF(Table1[[#This Row],[Type net]]=\"Individueel\",\"Ja\",\"Nee\")","v":"Nee"}]
["Collectieve warmtepomp - Hybride","Warmtenet","Warmtenet - Collectieve warmtepomp - Hybride","Centraal","N.v.t.",7.5,"MT","Het Firan-systeem is een hybride oplossing waarbij een centrale lucht-water warmtepomp de basis vormt voor het warmtenet. Voor piekbelasting wordt aanvullend een gasgestookte ketel ingezet. Dit modulaire systeem levert warmte op middeltemperatuur (45–75°C) aan woningen via convectoren. Het systeem is voorbereid op de toekomst: op termijn kan eenvoudig een andere duurzame bron, zoals aquathermie, geothermie of restwarmte, worden ingevoegd. Hierdoor is het systeem flexibel, snel inzetbaar en geschikt voor stapsgewijze uitbreiding in middelgrote dorpen en compacte wijken.",{"$f":"IF(Table1[[#This Row],[Aflevertemperatuur]]=\"ZLT\",\"A-B\",IF(Table1[[#This Row],[Aflevertemperatuur]]=\"LT\",\"A-C\",IF(Table1[[#This Row],[Aflevertemperatuur]]=\"MT\",\"A-D\",IF(Table1[[#This Row],[Aflevertemperatuur]]=\"HT\",\"Alles\",IF(Table1[[#This Row],[Aflevertemperatuur]]=\"LT/MT\",\"A-D\")))))","v":"A-D"},{"$f":"IF(Table1[[#This Row],[Opwaardering]]=\"Decentraal\",\"Nee\",IF(Table1[[#This Row],[Opwaardering]]=\"N.v.t.\",\"Nee\",\"Ja\"))","v":"Ja"},"Middelhoge dichtheid","Middel",5,"Nee","Nee","Nee",{"$f":"IF(Table1[[#This Row],[Schaalgrootte]]=\"Middel\",\"Lokaal mogelijk\",IF(Table1[[#This Row],[Schaalgrootte]]=\"Zeer groot\",\"Samenwerking noodzakelijk\",IF(Table1[[#This Row],[Schaalgrootte]]=\"Klein\",\"Lokaal mogelijk\",IF(Table1[[#This Row],[Schaalgrootte]]=\"Middelgroot\",\"Mogelijk samenwerking nodig\",IF(Table1[[#This Row],[Schaalgrootte]]=\"Individueel\",\"N.v.t.\",IF(Table1[[#This Row],[Schaalgrootte]]=\"Groot\",\"Mogelijk samenwerking nodig\",\"\"))))))","v":"Lokaal mogelijk"},"Middelgrote dorpen en/of compacte wijken","Gestapelde bouw, rijwoningen, kleine apartementen",{"$f":"IF(Table1[[#This Row],[Type net]]=\"Individueel\",\"Ja\",\"Nee\")","v":"Nee"}]
["Bodem-water warmtepomp","Individueel","Individueel - Bodem-water warmtepomp","N.v.t.","S1b",12.5,"ZLT","Warmte wordt onttrokken uit een gesloten bodemlus en via een individuele warmtepomp geleverd. Dit systeem werkt op ZLT-niveau (< 25°C), maakt gebruik van een warmtepomp en levert warmte via vloerverwarming of lage temperatuur radiatoren.",{"$f":"IF(Table1[[#This Row],[Aflevertemperatuur]]=\"ZLT\",\"A-B\",IF(Table1[[#This Row],[Aflevertemperatuur]]=\"LT\",\"A-C\",IF(Table1[[#This Row],[Aflevertemperatuur]]=\"MT\",\"A-D\",IF(Table1[[#This Row],[Aflevertemperatuur]]=\"HT\",\"Alles\",IF(Table1[[#This Row],[Aflevertemperatuur]]=\"LT/MT\",\"A-D\")))))","v":"A-B"},{"$f":"IF(Table1[[#This Row],[Opwaardering]]=\"Decentraal\",\"Nee\",IF(Table1[[#This Row],[Opwaardering]]=\"N.v.t.\",\"Nee\",\"Ja\"))","v":"Nee"},"N.v.t.","Individueel",5,"Ja","Nee","Ja",{"$f":"IF(Table1[[#This Row],[Schaalgrootte]]=\"Middel\",\"Lokaal mogelijk\",IF(Table1[[#This Row],[Schaalgrootte]]=\"Zeer groot\",\"Samenwerking noodzakelijk\",IF(Table1[[#This Row],[Schaalgrootte]]=\"Klein\",\"Lokaal mogelijk\",IF(Table1[[#This Row],[Schaalgrootte]]=\"Middelgroot\",\"Mogelijk samenwerking nodig\",IF(Table1[[#This Row],[Schaalgrootte]]=\"Individueel\",\"N.v.t.\",IF(Table1[[#This Row],[Schaalgrootte]]=\"Groot\",\"Mogelijk samenwerking nodig\",\"\"))))))","v":"N.v.t."},"Verspreide bebouwing en/of landelijke dorpen","Vrijstaande woningen, 2 onder 1 kap",{"$f":"IF(Table1[[#This Row],[Type net]]=\"Individueel\",\"Ja\",\"Nee\")","v":"Ja"}]
["Gesloten bodemenergie​","Individueel","Individueel - Gesloten bodemenergie​","N.v.t.","S1b",10,"LT","Gesloten bodemlussen leveren warmte aan een  warmtepomp. Dit systeem werkt op LT niveau (25-55°C) en levert warmte via vloerverwarming, lage temperatuur radiatoren of convectoren.",{"$f":"IF(Table1[[#This Row],[Aflevertemperatuur]]=\"ZLT\",\"A-B\",IF(Table1[[#This Row],[Aflevertemperatuur]]=\"LT\",\"A-C\",IF(Table1[[#This Row],[Aflevertemperatuur]]=\"MT\",\"A-D\",IF(Table1[[#This Row],[Aflevertemperatuur]]=\"HT\",\"Alles\",IF(Table1[[#This Row],[Aflevertemperatuur]]=\"LT/MT\",\"A-D\")))))","v":"A-C"},{"$f":"IF(Table1[[#This Row],[Opwaardering]]=\"Decentraal\",\"Nee\",IF(Table1[[#This Row],[Opwaardering]]=\"N.v.t.\",\"Nee\",\"Ja\"))","v":"Nee"},"N.v.t.","Individueel",4,"Ja","Nee","Ja",{"$f":"IF(Table1[[#This Row],[Schaalgrootte]]=\"Middel\",\"Lokaal mogelijk\",IF(Table1[[#This Row],[Schaalgrootte]]=\"Zeer groot\",\"Samenwerking noodzakelijk\",IF(Table1[[#This Row],[Schaalgrootte]]=\"Klein\",\"Lokaal mogelijk\",IF(Table1[[#This Row],[Schaalgrootte]]=\"Middelgroot\",\"Mogelijk samenwerking nodig\",IF(Table1[[#This Row],[Schaalgrootte]]=\"Individueel\",\"N.v.t.\",IF(Table1[[#This Row],[Schaalgrootte]]=\"Groot\",\"Mogelijk samenwerking nodig\",\"\"))))))","v":"N.v.t."},"Verspreide bebouwing en/of landelijke dorpen","Vrijstaande woningen, 2 onder 1 kap",{"$f":"IF(Table1[[#This Row],[Type net]]=\"Individueel\",\"Ja\",\"Nee\")","v":"Ja"}]
["Open bodemenergie","Individueel","Individueel - Open bodemenergie","N.v.t.","S1b",10,"ZLT","Warmte wordt onttrokken uit grondwater en geleverd via een individuele warmtepomp. Dit systeem werkt op ZLT-niveau (< 25°C), maakt gebruik van een warmtepomp en levert warmte via vloerverwarming of lage temperatuur radiatoren.",{"$f":"IF(Table1[[#This Row],[Aflevertemperatuur]]=\"ZLT\",\"A-B\",IF(Table1[[#This Row],[Aflevertemperatuur]]=\"LT\",\"A-C\",IF(Table1[[#This Row],[Aflevertemperatuur]]=\"MT\",\"A-D\",IF(Table1[[#This Row],[Aflevertemperatuur]]=\"HT\",\"Alles\",IF(Table1[[#This Row],[Aflevertemperatuur]]=\"LT/MT\",\"A-D\")))))","v":"A-B"},{"$f":"IF(Table1[[#This Row],[Opwaardering]]=\"Decentraal\",\"Nee\",IF(Table1[[#This Row],[Opwaardering]]=\"N.v.t.\",\"Nee\",\"Ja\"))","v":"Nee"},"N.v.t.","Individueel",4,"Ja","Nee","Ja",{"$f":"IF(Table1[[#This Row],[Schaalgrootte]]=\"Middel\",\"Lokaal mogelijk\",IF(Table1[[#This Row],[Schaalgrootte]]=\"Zeer groot\",\"Samenwerking noodzakelijk\",IF(Table1[[#This Row],[Schaalgrootte]]=\"Klein\",\"Lokaal mogelijk\",IF(Table1[[#This Row],[Schaalgrootte]]=\"Middelgroot\",\"Mogelijk samenwerking nodig\",IF(Table1[[#This Row],[Schaalgrootte]]=\"Individueel\",\"N.v.t.\",IF(Table1[[#This Row],[Schaalgrootte]]=\"Groot\",\"Mogelijk samenwerking nodig\",\"\"))))))","v":"N.v.t."},"Verspreide bebouwing en/of landelijke dorpen","Vrijstaande woningen, 2 onder 1 kap",{"$f":"IF(Table1[[#This Row],[Type net]]=\"Individueel\",\"Ja\",\"Nee\")","v":"Ja"}]
["PVT","Bronnet","Bronnet - PVT","Decentraal","N.v.t.",45,"LT","PVT-panelen leveren zowel elektriciteit als thermische energie aan decentrale warmtepompen. Dit systeem werkt op LT-niveau (25-40°C), maakt gebruik van een decentraal warmtepomp en levert warmte via vloerverwarming of lage temperatuur radiatoren.",{"$f":"IF(Table1[[#This Row],[Aflevertemperatuur]]=\"ZLT\",\"A-B\",IF(Table1[[#This Row],[Aflevertemperatuur]]=\"LT\",\"A-C\",IF(Table1[[#This Row],[Aflevertemperatuur]]=\"MT\",\"A-D\",IF(Table1[[#This Row],[Aflevertemperatuur]]=\"HT\",\"Alles\",IF(Table1[[#This Row],[Aflevertemperatuur]]=\"LT/MT\",\"A-D\")))))","v":"A-C"},{"$f":"IF(Table1[[#This Row],[Opwaardering]]=\"Decentraal\",\"Nee\",IF(Table1[[#This Row],[Opwaardering]]=\"N.v.t.\",\"Nee\",\"Ja\"))","v":"Nee"},"Middelhoge dichtheid","Klein",3,"Ja","Nee","Nee",{"$f":"IF(Table1[[#This Row],[Schaalgrootte]]=\"Middel\",\"Lokaal mogelijk\",IF(Table1[[#This Row],[Schaalgrootte]]=\"Zeer groot\",\"Samenwerking noodzakelijk\",IF(Table1[[#This Row],[Schaalgrootte]]=\"Klein\",\"Lokaal mogelijk\",IF(Table1[[#This Row],[Schaalgrootte]]=\"Middelgroot\",\"Mogelijk samenwerking nodig\",IF(Table1[[#This Row],[Schaalgrootte]]=\"Individueel\",\"N.v.t.\",IF(Table1[[#This Row],[Schaalgrootte]]=\"Groot\",\"Mogelijk samenwerking nodig\",\"\"))))))","v":"Lokaal mogelijk"},"Verspreide bebouwing en/of landelijke dorpen","Gestapelde bouw, rijwoningen, kleine apartementen",{"$f":"IF(Table1[[#This Row],[Type net]]=\"Individueel\",\"Ja\",\"Nee\")","v":"Nee"}]
["PVT (WKO)","Warmtenet","Warmtenet - PVT (WKO)","Centraal","N.v.t.",15,"LT","PVT-panelen leveren thermische energie aan een WKO-buffer, die via het warmtenet verspreidt. Dit systeem werkt op LT-niveau (25-40°C), maakt gebruik van een centrale warmtepomp en levert warmte via vloerverwarming of lage temperatuur radiatoren.",{"$f":"IF(Table1[[#This Row],[Aflevertemperatuur]]=\"ZLT\",\"A-B\",IF(Table1[[#This Row],[Aflevertemperatuur]]=\"LT\",\"A-C\",IF(Table1[[#This Row],[Aflevertemperatuur]]=\"MT\",\"A-D\",IF(Table1[[#This Row],[Aflevertemperatuur]]=\"HT\",\"Alles\",IF(Table1[[#This Row],[Aflevertemperatuur]]=\"LT/MT\",\"A-D\")))))","v":"A-C"},{"$f":"IF(Table1[[#This Row],[Opwaardering]]=\"Decentraal\",\"Nee\",IF(Table1[[#This Row],[Opwaardering]]=\"N.v.t.\",\"Nee\",\"Ja\"))","v":"Ja"},"Middelhoge dichtheid","Middel",3,"Ja","Nee","Ja",{"$f":"IF(Table1[[#This Row],[Schaalgrootte]]=\"Middel\",\"Lokaal mogelijk\",IF(Table1[[#This Row],[Schaalgrootte]]=\"Zeer groot\",\"Samenwerking noodzakelijk\",IF(Table1[[#This Row],[Schaalgrootte]]=\"Klein\",\"Lokaal mogelijk\",IF(Table1[[#This Row],[Schaalgrootte]]=\"Middelgroot\",\"Mogelijk samenwerking nodig\",IF(Table1[[#This Row],[Schaalgrootte]]=\"Individueel\",\"N.v.t.\",IF(Table1[[#This Row],[Schaalgrootte]]=\"Groot\",\"Mogelijk samenwerking nodig\",\"\"))))))","v":"Lokaal mogelijk"},"Verspreide bebouwing en/of landelijke dorpen","Gestapelde bouw, rijwoningen, kleine apartementen",{"$f":"IF(Table1[[#This Row],[Type net]]=\"Individueel\",\"Ja\",\"Nee\")","v":"Nee"}]

{"sheet":"D. Handelingsperspectief","index":8,"n_rows":65,"n_cols":14,"rows_kept":65,"cut":false,"hidden":true,"merged":[]}
["Type net","Scenario op basis van","Warmtebron & type net","Subtekst","Omschrijving","Randvoorwaarden","Nieuwbouw vs bestaande bouw","kansen","Inzet Gemeente","Kostenverdeling","nader onderzoeken van","Samenwerking zoeken met","isolatie stimuleren bij","Consequentie keuze"]
["Bronnet","Asfaltthermie - Thermische panelen in de weg",{"$f":"A2&\" - \"&B2","v":"Bronnet - Asfaltthermie - Thermische panelen in de weg"},{"$f":"VLOOKUP(Tabel3[[#This Row],[Warmtebron & type net]],'A. Breakdown'!$D$3:$G$64,4,FALSE)","v":"Een bronnet op basis van asfaltthermie"},"Thermische energie wordt gewonnen uit asfalt via ingegoten panelen, gekoppeld aan een decentrale warmtepomp in de woning. Dit systeem werkt op LT-niveau (25-40°C), maakt gebruik van een decentraal warmtepomp en levert warmte via vloerverwarming of lage temperatuur radiatoren.","Ruimte op het elektriciteitsnet;\nRuimte ondergrond voor systeem en leidingen;\nVoldoende isolatie;\nAfspraken met beheerder afalt;\nMaturatie van techniek;\nRuimte gebouwen voor individuele opwaardering","Kansrijk bij nieuwbouwprojecten met nog aan te leggen asfalt;\nBij bestaande bouw alleen toepasbaar bij goede isolatie en Ruimte voor systeem.","Kansrijk bij kernere kernen (200 tot 500) met een grotere warmtevraagdichtheid;\nKansrijk bij rijtjesgebouwen;\nKansrijk bij appartementen","Bronnet moet ontwikkeld worden, waarin de Gemeente een mogelijke rol kan spelen - dit betekent nadenken over investering en financiering; haalbaarheid en potentie moet onderzocht worden; techniek is innovatief en in pilotfase, dit zorgt voor langere ontwikkeltijd. Gemeente moet nadenken over tijdspad en planning;\naanwijzen warmtebedrijf\nGemeente kan sturen op collectieve inkoop voor de individuele opwaarderingssets voor de gebouweigenaren","Warmtebedrijf/exploitant (kan Gemeente zijn):\n-\tInfrastructuur net/leidingen\n-\tOntwikkeling bron\n-\tCentrale warmtepompen en regeltechniek\n-\tOnderhoudskosten\nEindgebruiker (eventueel via Woningcorporatie/verhuurder):\n-\tAansluitkosten\n-\tIsolatiekosten om aangesloten te kunnen worden\n-\tindividuele opwaarderingssysteem (warmtepomp)\n-Gebruikskosten/warmteafname\n-\tVaste maandelijkse lasten voor onderhoud\nLet op: Uiteindelijke kostenverdeling hangt af van keuzes en governance binnen het project en kunnen in wisselende mate bij de gebruiker of het warmtebedrijf liggen","Kansrijkheid oplossing\nSysteemoptimalisatie;\nRuimte ondergrond;\nEigenaarschap bron","Woningcorporaties;\nbewoners;\nprovincie - provinciale wegen;\nRWS","Vanaf energielabel C zijn aanvullende isolatiemaatregelen nodig. Gemeente kan dit stimuleren via collectieve inkoopacties en subsidies. LET OP: hoe hoger het energielabel/isolatie, hoe lager de elektriciteitskosten en hoe grotere energiebesparing","Kiezen voor dit warmtesysteem op basis van een bronnet betekent kiezen voor een collectief systeem met individuele opwaardering.\nEr is voor deze oplossing geen piekvoorziening nodig\nKiezen dit systeem betekent dat een straat/aantal gebouwen in een keer wordt aangesloten. Hierdoor gaat de transitie minder stapsgewijs - gebouweigenaren kunnen minder dan bij all-electric zelf het moment kiezen om aan te sluiten.\nKiezen voor dit systeem betekent kiezen voor een niet-breed toegepast systeem, waardoor investeringskosten hoog kunnen uitvallen. Het is belangrijk dat er wordt nagedacht waar deze kosten komen te liggen.\nDe techniek is nog premature, dus de oplossing is langetermijns en momenteel kostbaar. Dit betekent dat er bij deze optie goed nagedacht moet worden bij wie de investerings- en aansluitkosten komen te liggen.\nDit systeem is enkel een oplossing voor een kleinere aantal gebouwen en kan niet alle kernen of volledige kernen bedienen. Het kan eventueel wel als onderdeel van de warmtemix worden toegepast;\nSysteem is sterk afhankelijk van externe partijen en renovatieplannen hebben ook invloed op het systeem;"]
["Bronnet","Datathermie","Bronnet - Datathermie",{"$f":"VLOOKUP(Tabel3[[#This Row],[Warmtebron & type net]],'A. Breakdown'!$D$3:$G$64,4,FALSE)","v":"Een bronnet op basis van datathermie"},"Restwarmte van datacenters wordt via een bronnet en decentrale warmtepompen benut. Dit systeem werkt op LT-niveau (25-40°C), maakt gebruik van een decentraal warmtepomp en levert warmte via vloerverwarming of lage temperatuur radiatoren.","Ruimte op het elektriciteitsnet;\nRuimte ondergrond voor systeem en leidingen;\nVoldoende isolatie;\nAfspraken met beheerder datacentrum;\nRuimte gebouwen voor individuele opwaardering","Kansrijk bij nieuwbouw in stedelijke gebieden met hoge dichtheid; Bij bestaande bouw afhankelijk van ligging en netcapaciteit.","Kansrijk bij kernere kernen (200 tot 500) met een grotere warmtevraagdichtheid;\nKansrijk bij rijtjesgebouwen;\nKansrijk bij appartementen","Bronnet moet ontwikkeld worden, waarin de Gemeente een mogelijke rol kan spelen - dit betekent nadenken over investering en financiering; haalbaarheid en potentie moet onderzocht worden; techniek is innovatief en in pilotfase, dit zorgt voor langere ontwikkeltijd. Gemeente moet nadenken over tijdspad en planning;\naanwijzen warmtebedrijf\nGemeente kan sturen op collectieve inkoop voor de individuele opwaarderingssets voor de gebouweigenaren","Warmtebedrijf/exploitant (kan Gemeente zijn):\n-\tInfrastructuur net/leidingen\n-\tOntwikkeling bron\n-\tCentrale warmtepompen en regeltechniek\n-\tOnderhoudskosten\nEindgebruiker (eventueel via Woningcorporatie/verhuurder):\n-\tAansluitkosten\n-\tIsolatiekosten om aangesloten te kunnen worden\n-\tindividuele opwaarderingssysteem (warmtepomp)\n-Gebruikskosten/warmteafname\n-\tVaste maandelijkse lasten voor onderhoud\nLet op: Uiteindelijke kostenverdeling hangt af van keuzes en governance binnen het project en kunnen in wisselende mate bij de gebruiker of het warmtebedrijf liggen","Oplossing voor piekvoorziening;\n back-up bron/systeem; \nbeschikbare warmte; \nmogelijkheden voor collectieve inkoopacties individueel opwaardeersysteem.","broneigenaar; netbeheerder","Vanaf label c of lager verregaande isolatiemaatregelen nodig om bron te kunnen realiseren. Dit betekent niet dat dit onmogelijk is - het kan Gemeentelijk gestimuleerd worden door bijvoorbeeld collectieve inkoopacties, informeren, subsidies en een contigentenaanpak voor isolatie","kiezen voor deze oplossingsrichting betekent een voorkeur uitspreken voor (kleinschalig) collectieve warmteoplossingen met een jaarronddragende bron.\nKiezen voor dit warmtesysteem op basis van een bronnet betekent kiezen voor een collectief systeem met individuele opwaardering.\nDe bron is duurzaam, maar gebasseerd op (commerciele) bedrijven en daardoor fragieler in de levering. Het is daarom nodig om een terugvaloptie te onderzoeken.\nDeze oplossing biedt geen koeling, hier moet onderzoek naar worden gedaan.\nBij deze oplossingsrichting is een piekvoorziening nodig bij hoge warmtevraag (bijvoorbeeld koude dagen) - kiezen voor deze oplossing betekent dat hierover nagedacht moet worden (back up ketel bijvoorbeeld);\nEr is voor deze oplossing geen piekvoorziening nodig"]
["Bronnet","Ondiepe geothermie","Bronnet - Ondiepe geothermie",{"$f":"VLOOKUP(Tabel3[[#This Row],[Warmtebron & type net]],'A. Breakdown'!$D$3:$G$64,4,FALSE)","v":"Een bronnet op basis van ondiepe geothermie"},"Ondiepe geothermie op basis van een bronnet is een systeem waar warmte vanuit de ondergrond (tot 1500 m) wordt ingezet voor de verwarming van huizen. Via een collectief systeem wordt de warmte naar gebouwen vervoerd, waarna middels individuele opwaardering de huizen worden verwarmd.","Ruimte op het elektriciteitsnet;\nRuimte ondergrond voor systeem en leidingen;\nVoldoende isolatie;\nRuimte gebouwen voor individuele opwaardering","Kansrijk bij nieuwbouw vanwege hoge isolatiegraad en directe aansluiting; Bij bestaande bouw alleen toepasbaar als gebouwen voldoende geïsoleerd zijn.","Stabiele, jaarronddragende bron; \nKanrijk bij goed geisoleerde huizen in grotere kernen;\n Kansrijk bij rijgebouwen en appartementen; \nKansrijk bij stedelijke (1500 tot 5000 weq) kernen;","Bronnet moet ontwikkeld worden, waarin de Gemeente een mogelijke rol kan spelen - dit betekent nadenken over investering en financiering; haalbaarheid en potentie moet onderzocht worden; techniek is innovatief en in pilotfase, dit zorgt voor langere ontwikkeltijd. Gemeente moet nadenken over tijdspad en planning;\naanwijzen warmtebedrijf\nGemeente kan sturen op collectieve inkoop voor de individuele opwaarderingssets voor de gebouweigenaren","Warmtebedrijf/exploitant (kan Gemeente zijn):\n-\tInfrastructuur net/leidingen\n-\tOntwikkeling bron\n-\tCentrale warmtepompen en regeltechniek\n-\tOnderhoudskosten\nEindgebruiker (eventueel via Woningcorporatie/verhuurder):\n-\tAansluitkosten\n-\tIsolatiekosten om aangesloten te kunnen worden\n-\tindividuele opwaarderingssysteem (warmtepomp)\n-Gebruikskosten/warmteafname\n-\tVaste maandelijkse lasten voor onderhoud\nLet op: Uiteindelijke kostenverdeling hangt af van keuzes en governance binnen het project en kunnen in wisselende mate bij de gebruiker of het warmtebedrijf liggen","Potentie bron; proefboring; businesscase systeem; vergunningen voor benutting bron; Ruimtelijke impassing systeem","(Eventueel) aangenzende Gemeenten/kernen voor voldoende afzet; EBN voor expertise en bronontwikkeling; Provincie en rijk voor ontwikkeling bron","Vanaf label c of lager verregaande isolatiemaatregelen nodig om bron te kunnen realiseren. Dit betekent niet dat dit onmogelijk is - het kan Gemeentelijk gestimuleerd worden door bijvoorbeeld collectieve inkoopacties, informeren, subsidies en een contigentenaanpak voor isolatie","Kiezen voor dit warmtesysteem op basis van een bronnet betekent kiezen voor een collectief systeem waarbij warmte en koelte individueel geregeld kan worden. Warmteoplossing heeft lange ontwikkeltijd maar is toekomstbestendig en jaarronddragend. De lange ontwikkeltijd kan het vollooprisico juist minimaliseren, omdat een eventuele warmtepomp in de ontwikkeltijd afgeschreven wordt en gebouwen daarna een nieuwe oplossing nodig hebben (bijvoorbeeld het warmtenet op basis van ondiepe geothermie).\nDe Gemeente kan er voor kiezen om een tussenoplossing te zoeken;\nKiezen voor deze oplossing betekent een voorkeur uitspreken van een collectief systeem met individuele opwaardering. Dit betekent energzijds gelijktijdigheid van collectiviteit, maar vraagt om investering en aanpassingen van individuele gebouweigenaar.\nKiezen voor een collectieve WKO betekent dat een straat/aantal gebouwen in een keer wordt aangesloten. Hierdoor gaat de transitie minder stapsgewijs - gebouweigenaren kunnen minder dan bij all-electric zelf het moment kiezen om aan te sluiten."]
["Bronnet","Open bodemenergie (WKO)","Bronnet - Open bodemenergie (WKO)",{"$f":"VLOOKUP(Tabel3[[#This Row],[Warmtebron & type net]],'A. Breakdown'!$D$3:$G$64,4,FALSE)","v":"Een bronnet op basis van een open bodemenergie systeem (WKO)"},"Grondwater wordt in de zomer opgewarmd en opgeslagen in een bron. In de winter wordt het opgepompt en via een warmtepomp gebruikt voor verwarming. OWKO is een warmteoplossing dat vanaf 1 huishouden kan werken en eventueel opgeschaalt kan worden.","Ruimte op het elektriciteitsnet;\nRuimte ondergrond voor systeem en leidingen én WKO;\nVoldoende isolatie;\nRuimte gebouwen voor individuele opwaardering","Kansrijk bij nieuwbouw door goede isolatie en aanlegmogelijkheden - de gebouwen moeten gebouwd worden waardoor niet achteraf ingrepen gedaan hoeven te worden; Bij bestaande bouw alleen toepasbaar na isolatie en technische aanpassingen.","Kanrijk bij kleinere dorpen (tot 200 weq)  en compacte wijken;\nKansrijk bij rijgebouwen en apartementen;\nKansrijk op kleine schaal (gedeelde bodemlus)","Bronnet moet ontwikkeld worden, waarin de Gemeente een mogelijke rol kan spelen - dit betekent nadenken over investering en financiering; haalbaarheid en potentie moet onderzocht worden; techniek is innovatief en in pilotfase, dit zorgt voor langere ontwikkeltijd. Gemeente moet nadenken over tijdspad en planning;\naanwijzen warmtebedrijf\nGemeente kan sturen op collectieve inkoop voor de individuele opwaarderingssets voor de gebouweigenaren","Warmtebedrijf/exploitant (kan Gemeente zijn):\n-\tInfrastructuur net/leidingen\n-\tOntwikkeling bron\n-\tCentrale warmtepompen en regeltechniek\n-\tOnderhoudskosten\nEindgebruiker (eventueel via Woningcorporatie/verhuurder):\n-\tAansluitkosten\n-\tIsolatiekosten om aangesloten te kunnen worden\n-\tindividuele opwaarderingssysteem (warmtepomp)\n-Gebruikskosten/warmteafname\n-\tVaste maandelijkse lasten voor onderhoud\nLet op: Uiteindelijke kostenverdeling hangt af van keuzes en governance binnen het project en kunnen in wisselende mate bij de gebruiker of het warmtebedrijf liggen","De beschikbare Ruimte op het energienet, omdat het systeem aanvullende energie vereist; juridische restricies, in sommige gevallen is het systeem niet mogelijk; Ruimte in de ondergrond, systeem vraagt voldoende Ruimte ondergronds. Onderzoek en eventueel aanvullend beleid hierover kan helpen.","Netbeheerders; VvEs en woningbouwcorporaties van appartementsgebouwen; beleidsambtenaren voor het thema ondergrond","Vanaf label c of lager verregaande isolatiemaatregelen nodig om bron te kunnen realiseren. Dit betekent niet dat dit onmogelijk is - het kan Gemeentelijk gestimuleerd worden door bijvoorbeeld collectieve inkoopacties, informeren, subsidies en een contigentenaanpak voor isolatie","Kiezen voor dit warmtesysteem op basis van een bronnet betekent kiezen voor een systeem waarbij warmte en koelte individueel geregeld kan worden. Kiezen voor een collectieve WKO betekent dat een straat/aantal gebouwen in een keer wordt aangesloten. Hierdoor gaat de transitie minder stapsgewijs - gebouweigenaren kunnen minder dan bij all-electric zelf het moment kiezen om aan te sluiten. Systeem kan zeer lokaal ontwikkeld worden, door bijvoorbeeld bewonersinitiatieven. Gemeente kan dit stimuleren of regisseren. Het systeem is kleinschalig, wat betekent dat via een ontheffing een bewonersiinitatief of private onderneming kan intekenen, of een publieke partij (de Gemeente) zelf initiatiefnemer wordt. Bij de eerste twee opties bestaat de kans op \"cherry-picking\"; de relatief eenvoudig aan te sluiten gebouwen worden wel en de lastig aan te sluiten gebouwen niet aangesloten. De techniek is nog premature, dus de oplossing is langetermijns en momenteel kostbaar. Dit betekent dat er bij deze optie goed nagedacht moet worden bij wie de investerings- en aansluitkosten komen te liggen. Dit systeem is enkel een oplossing voor een kleinere aantal gebouwen en kan niet alle kernen of volledige kernen bedienen. Het kan eventueel wel als onderdeel van de warmtemix worden toegepast"]
["Bronnet","PVT","Bronnet - PVT",{"$f":"VLOOKUP(Tabel3[[#This Row],[Warmtebron & type net]],'A. Breakdown'!$D$3:$G$64,4,FALSE)","v":"Een bronnet op basis van PVT-zonnepanelen"},"Combinatie van zonnepanelen (elektriciteit) en thermische panelen (warmte). De warmte wordt gebruikt of opgeslagen.","Ruimte op het elektriciteitsnet;\nRuimte ondergrond voor systeem en leidingen;\nVoldoende isolatie;\nRuimte gebouwen voor individuele opwaardering","Kansrijk bij nieuwbouw met Ruimte voor panelen en goede isolatie; Bij bestaande bouw afhankelijk van dakoppervlak en netcapaciteit.","Systeem geschikt voor kleine (2 tot 200 weq) kernen; \nKansrijk bij wijken in de buurt van sportvelden.","Bronnet moet ontwikkeld worden, waarin de Gemeente een mogelijke rol kan spelen - dit betekent nadenken over investering en financiering; haalbaarheid en potentie moet onderzocht worden; techniek is innovatief en in pilotfase, dit zorgt voor langere ontwikkeltijd. Gemeente moet nadenken over tijdspad en planning;\naanwijzen warmtebedrijf\nGemeente kan sturen op collectieve inkoop voor de individuele opwaarderingssets voor de gebouweigenaren","Warmtebedrijf/exploitant (kan Gemeente zijn):\n-\tInfrastructuur net/leidingen\n-\tOntwikkeling bron\n-\tCentrale warmtepompen en regeltechniek\n-\tOnderhoudskosten\nEindgebruiker (eventueel via Woningcorporatie/verhuurder):\n-\tAansluitkosten\n-\tIsolatiekosten om aangesloten te kunnen worden\n-\tindividuele opwaarderingssysteem (warmtepomp)\n-Gebruikskosten/warmteafname\n-\tVaste maandelijkse lasten voor onderhoud\nLet op: Uiteindelijke kostenverdeling hangt af van keuzes en governance binnen het project en kunnen in wisselende mate bij de gebruiker of het warmtebedrijf liggen","Ruimte pvt-panelen; \neigenaarschap bron;\nRuimte ondergrond leidingen;\nRuimte individuele warmtepomp","Bewonersinitiatieven;\ninstallateurs","Vanaf label c of lager verregaande isolatiemaatregelen nodig om bron te kunnen realiseren. Dit betekent niet dat dit onmogelijk is - het kan Gemeentelijk gestimuleerd worden door bijvoorbeeld collectieve inkoopacties, informeren, subsidies en een contigentenaanpak voor isolatie","Kiezen voor deze warmteoplossing betekent een voorkeur uitspreken voor een collectief systeem met individueel opwaardering. Dit betekent energzijds gelijktijdigheid van collectiviteit, maar vraagt om investering en aanpassingen van individuele gebouweigenaar. De oplossingsrichting biedt hierdoor mogelijkheid tot koeling. Daarnaast is er voldoende Ruimte op het net nodig voor het systeem en de opslag van de warmte/energie."]
["Bronnet","Sportveld thermie","Bronnet - Sportveld thermie",{"$f":"VLOOKUP(Tabel3[[#This Row],[Warmtebron & type net]],'A. Breakdown'!$D$3:$G$64,4,FALSE)","v":"Een bronnet op basis van sportveld thermie"},"Sportvelden leveren warmte aan een WKO-buffer, dat via een centrale warmtepomp in het warmtenet wordt verspreid. Dit systeem werkt op zLT-niveau (25-50°C), maakt gebruik van een individuele warmtepomp/individuele opwaardering en levert warmte via vloerverwarming, lage temperatuur radiatoren of convectoren.","Aanwezigheid sportveld\nRuimte op het elektriciteitsnet;\nRuimte ondergrond voor systeem en leidingen;\nVoldoende isolatie;\nMaturatie van techniek;\nRuimte gebouwen voor individuele opwaardering","Kansrijk bij nieuwbouw met aanleg van sportvelden; Bij bestaande bouw alleen toepasbaar als er een sportveld in de buurt is.","Systeem geschikt voor kleinere dorpen (2 tot 200 weq) en compacte wijken; \nKansrijk bij wijken in de buurt van sportvelden.","Bronnet moet ontwikkeld worden, waarin de Gemeente een mogelijke rol kan spelen - dit betekent nadenken over investering en financiering; haalbaarheid en potentie moet onderzocht worden; techniek is innovatief en in pilotfase, dit zorgt voor langere ontwikkeltijd. Gemeente moet nadenken over tijdspad en planning;\naanwijzen warmtebedrijf\nGemeente kan sturen op collectieve inkoop voor de individuele opwaarderingssets voor de gebouweigenaren","Warmtebedrijf/exploitant (kan Gemeente zijn):\n-\tInfrastructuur net/leidingen\n-\tOntwikkeling bron\n-\tCentrale warmtepompen en regeltechniek\n-\tOnderhoudskosten\nEindgebruiker (eventueel via Woningcorporatie/verhuurder):\n-\tAansluitkosten\n-\tIsolatiekosten om aangesloten te kunnen worden\n-\tindividuele opwaarderingssysteem (warmtepomp)\n-Gebruikskosten/warmteafname\n-\tVaste maandelijkse lasten voor onderhoud\nLet op: Uiteindelijke kostenverdeling hangt af van keuzes en governance binnen het project en kunnen in wisselende mate bij de gebruiker of het warmtebedrijf liggen","Isolatiekansen; \nRuimte ondergrond leidingen;\nRuimte individuele warmtepomp\nhaalbaarheid systeem; \nback-up bron","Eigenaar sportvelden; inwoners; netbeheerder","Vanaf label c of lager verregaande isolatiemaatregelen nodig om bron te kunnen realiseren. Dit betekent niet dat dit onmogelijk is - het kan Gemeentelijk gestimuleerd worden door bijvoorbeeld collectieve inkoopacties, informeren, subsidies en een contigentenaanpak voor isolatie","Kiezen voor dit warmtesysteem op basis van een bronnet betekent kiezen voor een systeem waarbij warmte en koelte individueel geregeld kan worden. Het betekent goede afstemming en planning met de eigenaar van de locatie. Dit kan de Gemeente zelf zijn of een externe. Het systeem is kleinschalig, wat betekent dat via een ontheffing een bewonersiinitatief of private onderneming kan intekenen, of een publieke partij (de Gemeente) zelf initiatiefnemer wordt. Bij de eerste twee opties bestaat de kans op \"cherry-picking\"; de relatief eenvoudig aan te sluiten gebouwen worden wel en de lastig aan te sluiten gebouwen niet aangesloten. De techniek is nog premature, dus de oplossing is langetermijns en momenteel kostbaar. Dit betekent dat er bij deze optie goed nagedacht moet worden bij wie de investerings- en aansluitkosten komen te liggen. Dit systeem is enkel een oplossing voor een kleinere aantal gebouwen en kan niet alle kernen of volledige kernen bedienen. Het kan eventueel wel als onderdeel van de warmtemix worden toegepast"]
["Bronnet","Thermische energie uit afvalwater - leidingen (TEA)","Bronnet - Thermische energie uit afvalwater - leidingen (TEA)",{"$f":"VLOOKUP(Tabel3[[#This Row],[Warmtebron & type net]],'A. Breakdown'!$D$3:$G$64,4,FALSE)","v":"Een bronnet op basis van afvalwater aquathermie uit leidingen (TEA)"},"Warmte uit afvalwaterleidingen wordt lokaal onttrokken en via decentrale warmtepompen benut. Dit systeem werkt op ZLT-niveau (< 25°C), maakt gebruik van een decentraal warmtepomp en levert warmte via vloerverwarming of lage temperatuur radiatoren.","Aanwezigheid bron;\nRuimte op het elektriciteitsnet;\nRuimte ondergrond voor systeem en leidingen;\nVoldoende isolatie;\nRuimte gebouwen voor individuele opwaardering","Toepasbaar bij zowel nieuwbouw als bestaande bouw; \nBij bestaande bouw afhankelijk van leidingstructuur en hygiëneregels.","Bron is op veel plekken beschikbaar;\nGoed geïsoleerde huizen; \nKansrijk bij kleine tot midden (200 tot 500 weq) kernen;\nKansrijk bij hoogbouw en rijtjeshuizen","Bronnet moet ontwikkeld worden, waarin de Gemeente een mogelijke rol kan spelen - dit betekent nadenken over investering en financiering; haalbaarheid en potentie moet onderzocht worden; techniek is innovatief en in pilotfase, dit zorgt voor langere ontwikkeltijd. Gemeente moet nadenken over tijdspad en planning; Gemeente moet afstemmen met eigenaren Supermarkten;\naanwijzen warmtebedrijf\nGemeente kan sturen op collectieve inkoop voor de individuele opwaarderingssets voor de gebouweigenaren","Warmtebedrijf/exploitant (kan Gemeente zijn):\n-\tInfrastructuur net/leidingen\n-\tOntwikkeling bron\n-\tCentrale warmtepompen en regeltechniek\n-\tOnderhoudskosten\nEindgebruiker (eventueel via Woningcorporatie/verhuurder):\n-\tAansluitkosten\n-\tIsolatiekosten om aangesloten te kunnen worden\n-\tindividuele opwaarderingssysteem (warmtepomp)\n-Gebruikskosten/warmteafname\n-\tVaste maandelijkse lasten voor onderhoud\nLet op: Uiteindelijke kostenverdeling hangt af van keuzes en governance binnen het project en kunnen in wisselende mate bij de gebruiker of het warmtebedrijf liggen","Ruimte ondergrond;\n potentie bron;\n mogelijkheden voor collectieve inkoopacties individueel opwaardeersysteem.\nRuimte ondergrond leidingen;\nRuimte individuele warmtepomp","RWZI; eventueel andere Gemeenten; beleidsafdeling ondergrond/Ruimtelijke omgeving","Vanaf label c of lager verregaande isolatiemaatregelen nodig om bron te kunnen realiseren. Dit betekent niet dat dit onmogelijk is - het kan Gemeentelijk gestimuleerd worden door bijvoorbeeld collectieve inkoopacties, informeren, subsidies en een contigentenaanpak voor isolatie","Kiezen voor deze warmteoplossing betekent een voorkeur uitspreken voor een collectief systeem met individueel opwaardering. Dit betekent energzijds gelijktijdigheid van collectiviteit, maar vraagt om investering en aanpassingen van individuele gebouweigenaar. Het systeem is een bewezen technologie en kan technisch gezien relatief snel uitgerold worden. Het systeem vraagt hoge investeringskosten en hoge isolatie."]
["Bronnet","Thermische energie uit afvalwater - RWZI (TEA)","Bronnet - Thermische energie uit afvalwater - RWZI (TEA)",{"$f":"VLOOKUP(Tabel3[[#This Row],[Warmtebron & type net]],'A. Breakdown'!$D$3:$G$64,4,FALSE)","v":"Een bronnet op basis van afvalwater aquathermie (TEA) uit de RWZI"},"Restwarmte uit afvalwater bij RWZI wordt via een warmtewisselaar en decentrale warmtepomp benut. Dit systeem werkt op ZLT-niveau (< 25°C), maakt gebruik van een decentraal warmtepomp en levert warmte via vloerverwarming of lage temperatuur radiatoren.","Aanwezigheid bron;\nRuimte op het elektriciteitsnet;\nRuimte ondergrond voor systeem en leidingen;\nVoldoende isolatie;\nRuimte gebouwen voor individuele opwaardering","Toepasbaar Bij bestaande bouw met nabijheid van RWZI; bij nieuwbouw Kansrijk bij hoge dichtheid en goede isolatie.","Jaarronddragende bron\nGoed geïsoleerde huizen; \nKansrijk bij kleine tot midden (200 tot 500 weq) kernen;\nKansrijk bij hoogbouw en rijtjeshuizen","Bronnet moet ontwikkeld worden, waarin de Gemeente een mogelijke rol kan spelen - dit betekent nadenken over investering en financiering; haalbaarheid en potentie moet onderzocht worden; techniek is innovatief en in pilotfase, dit zorgt voor langere ontwikkeltijd. Gemeente moet nadenken over tijdspad en planning; Gemeente moet afstemmen met eigenaren Supermarkten;\naanwijzen warmtebedrijf\nGemeente kan sturen op collectieve inkoop voor de individuele opwaarderingssets voor de gebouweigenaren","Warmtebedrijf/exploitant (kan Gemeente zijn):\n-\tInfrastructuur net/leidingen\n-\tOntwikkeling bron\n-\tCentrale warmtepompen en regeltechniek\n-\tOnderhoudskosten\nEindgebruiker (eventueel via Woningcorporatie/verhuurder):\n-\tAansluitkosten\n-\tIsolatiekosten om aangesloten te kunnen worden\n-\tindividuele opwaarderingssysteem (warmtepomp)\n-Gebruikskosten/warmteafname\n-\tVaste maandelijkse lasten voor onderhoud\nLet op: Uiteindelijke kostenverdeling hangt af van keuzes en governance binnen het project en kunnen in wisselende mate bij de gebruiker of het warmtebedrijf liggen","Ruimte ondergrond leidingen;\nRuimte individuele warmtepomp;\npotentie RWZI","Netbeheerder; eigenaar RWZI;","Vanaf label c of lager verregaande isolatiemaatregelen nodig om bron te kunnen realiseren. Dit betekent niet dat dit onmogelijk is - het kan Gemeentelijk gestimuleerd worden door bijvoorbeeld collectieve inkoopacties, informeren, subsidies en een contigentenaanpak voor isolatie","Kiezen voor dit warmtesysteem op basis van een bronnet betekent kiezen voor een systeem waarbij warmte en koelte individueel geregeld kan worden. Dit betekent energzijds gelijktijdigheid van collectiviteit, maar vraagt om investering en aanpassingen van individuele gebouweigenaar. Het systeem vraagt om samenwerkinge en dus afhankelijkheid van externe partij. Het systeem is een bewezen technologie en kan technisch gezien relatief snel uitgerold worden. Het systeem is kostbaar, omdat het hoge investeringskosten en hoge isolatie vraagt."]
["Bronnet","Thermische energie uit afvalwater - RWZI (TEA)​ + WKO","Bronnet - Thermische energie uit afvalwater - RWZI (TEA)​ + WKO",{"$f":"VLOOKUP(Tabel3[[#This Row],[Warmtebron & type net]],'A. Breakdown'!$D$3:$G$64,4,FALSE)","v":"Een bronnet op basis van afvalwater aquathermie (TEA) uit de RWZI, inclusief WKO"},"Restwarmte uit afvalwater bij RWZI wordt via een warmtewisselaar en decentrale warmtepomp benut. Dit systeem werkt op ZLT-niveau (< 25°C), maakt gebruik van een decentraal warmtepomp en levert warmte via vloerverwarming of lage temperatuur radiatoren.","Aanwezigheid bron;\nRuimte op het elektriciteitsnet;\nRuimte ondergrond voor systeem en leidingen;\nVoldoende isolatie;\nRuimte gebouwen voor individuele opwaardering","Toepasbaar Bij bestaande bouw met nabijheid van RWZI; bij nieuwbouw Kansrijk bij hoge dichtheid en goede isolatie.","Goed geïsoleerde huizen; \nKansrijk bij kleine tot midden (200 tot 500 weq) kernen;\nKansrijk bij hoogbouw en rijtjeshuizen","Bronnet moet ontwikkeld worden, waarin de Gemeente een mogelijke rol kan spelen - dit betekent nadenken over investering en financiering; haalbaarheid en potentie moet onderzocht worden; techniek is innovatief en in pilotfase, dit zorgt voor langere ontwikkeltijd. Gemeente moet nadenken over tijdspad en planning; Gemeente moet afstemmen met eigenaren RWZI;\naanwijzen warmtebedrijf\nGemeente kan sturen op collectieve inkoop voor de individuele opwaarderingssets voor de gebouweigenaren","Warmtebedrijf/exploitant (kan Gemeente zijn):\n-\tInfrastructuur net/leidingen\n-\tOntwikkeling bron\n-\tCentrale warmtepompen en regeltechniek\n-\tOnderhoudskosten\nEindgebruiker (eventueel via Woningcorporatie/verhuurder):\n-\tAansluitkosten\n-\tIsolatiekosten om aangesloten te kunnen worden\n-\tindividuele opwaarderingssysteem (warmtepomp)\n-Gebruikskosten/warmteafname\n-\tVaste maandelijkse lasten voor onderhoud\nLet op: Uiteindelijke kostenverdeling hangt af van keuzes en governance binnen het project en kunnen in wisselende mate bij de gebruiker of het warmtebedrijf liggen","Ruimte op het elektriciteitsnet; \nRuimte ondergrond; \npotentie bron en systeem;\nafhankelijkheid eigenaar bron","Eigenaar RWZI;\nBeleidsafdeling ondergrond;","Vanaf label c of lager verregaande isolatiemaatregelen nodig om bron te kunnen realiseren. Dit betekent niet dat dit onmogelijk is - het kan Gemeentelijk gestimuleerd worden door bijvoorbeeld collectieve inkoopacties, informeren, subsidies en een contigentenaanpak voor isolatie","Kiezen voor deze warmteoplossing betekent een voorkeur uitspreken voor een collectief systeem met individueel opwaardering. Dit betekent energzijds gelijktijdigheid van collectiviteit, maar vraagt om investering en aanpassingen van individuele gebouweigenaar. Het systeem is een bewezen technologie en kan technisch gezien relatief snel uitgerold worden. Het systeem vraagt hoge investeringskosten en hoge isolatie."]
["Bronnet","Thermische energie uit drinkwater (TED)","Bronnet - Thermische energie uit drinkwater (TED)",{"$f":"VLOOKUP(Tabel3[[#This Row],[Warmtebron & type net]],'A. Breakdown'!$D$3:$G$64,4,FALSE)","v":"Een bronnet op basis van drinkwater aquathermie (TED)"},"Drinkwaterleidingen leveren thermische energie aan een centrale warmtepomp, die via het warmtenet verspreidt en individueel wordt opgewaardeerd. Dit systeem werkt op LT-niveau (25-75°C), maakt gebruik van een centrale warmtepomp en levert warmte via vloerverwarming, lage temperatuur radiatoren of convectoren.","Aanwezigheid bron;\nRuimte op het elektriciteitsnet;\nRuimte ondergrond voor systeem en leidingen;\nVoldoende isolatie;\nRuimte gebouwen voor individuele opwaardering","Kansrijk bij nieuwbouw met hoge warmtedichtheid en goede isolatie;\nBij bestaande bouw technisch complex en minder toepasbaar.","Bron op veel plaatsen aanwezig, maakt de oplossing kansrijker;\nKansrijk bij kernen met gestapelde bouw;\nKansrijk bij kernen met een hoge warmtedichtheid;\nkanrijk bij kleine tot middel (200 tot 500 weq) kernen","Bronnet moet ontwikkeld worden, waarin de Gemeente een mogelijke rol kan spelen - dit betekent nadenken over investering en financiering; haalbaarheid en potentie moet onderzocht worden; techniek is innovatief en in pilotfase, dit zorgt voor langere ontwikkeltijd. Gemeente moet nadenken over tijdspad en planning; Gemeente moet afstemmen met Waterschappen;\naanwijzen warmtebedrijf\nGemeente kan sturen op collectieve inkoop voor de individuele opwaarderingssets voor de gebouweigenaren","Warmtebedrijf/exploitant (kan Gemeente zijn):\n-\tInfrastructuur net/leidingen\n-\tOntwikkeling bron\n-\tCentrale warmtepompen en regeltechniek\n-\tOnderhoudskosten\nEindgebruiker (eventueel via Woningcorporatie/verhuurder):\n-\tAansluitkosten\n-\tIsolatiekosten om aangesloten te kunnen worden\n-\tindividuele opwaarderingssysteem (warmtepomp)\n-Gebruikskosten/warmteafname\n-\tVaste maandelijkse lasten voor onderhoud\nLet op: Uiteindelijke kostenverdeling hangt af van keuzes en governance binnen het project en kunnen in wisselende mate bij de gebruiker of het warmtebedrijf liggen","Risico-gebieden in kaart;\nRuimte elektriciteitsnet benodigde vergunningen;\npotentie bron;\nmogelijkheden voor collectieve inkoopacties individueel opwaardeersysteem.","waterschappen;\nNetbeheerder;\nGemeentelijke afdeling ondergrond","Vanaf label c of lager verregaande isolatiemaatregelen nodig om bron te kunnen realiseren. Dit betekent niet dat dit onmogelijk is - het kan Gemeentelijk gestimuleerd worden door bijvoorbeeld collectieve inkoopacties, informeren, subsidies en een contigentenaanpak voor isolatie","Kiezen voor deze oplossing betekent een voorkeur uitspreken van een collectief systeem met individuele opwaardering.\nDit betekent energzijds gelijktijdigheid van collectiviteit, maar vraagt om investering en aanpassingen van individuele gebouweigenaar. Aquathermie vraagt doorgaans veel extra energie, dus er moet voldoende Ruimte op het net zijn.\nDaarnaast is het belangrijk om scherp te krijgen bij wie de kosten komen te liggen (zowel voor het collectieve als voor het individuele)\nKiezen voor deze oplossing betekent kiezen voor een oplossing met koelingsmogelijkheden;"]
["Bronnet","Thermische energie uit drinkwater (TED) + WKO","Bronnet - Thermische energie uit drinkwater (TED) + WKO",{"$f":"VLOOKUP(Tabel3[[#This Row],[Warmtebron & type net]],'A. Breakdown'!$D$3:$G$64,4,FALSE)","v":"Een bronnet op basis van drinkwater aquathermie (TED), inclusief WKO"},"Drinkwaterleidingen leveren thermische energie aan een centrale warmtepomp, die via het warmtenet verspreidt en individueel wordt opgewaardeerd. Dit systeem werkt op LT-niveau (25-75°C), maakt gebruik van een centrale warmtepomp en levert warmte via vloerverwarming, lage temperatuur radiatoren of convectoren.","Bron aanwezig;\nGeen inteverenties met hygiene-standaarden;\nRuimte ondergrond voor WKO;\nGeen restricties waterwinningsgebied;\nRuimte op het elektriciteitsnet;\nVoldoende afzet;\nRuimte ondergrond voor warmtenet","Kansrijk bij nieuwbouw met hoge warmtedichtheid en goede isolatie;\nBij bestaande bouw technisch complex en minder toepasbaar.","Bron op veel plaatsen aanwezig, maakt de oplossing kansrijker;\nKansrijk bij kernen met gestapelde bouw;\nKansrijk bij kernen met een hoge warmtedichtheid;\nkanrijk bij kleine tot middel (200 tot 500 weq) kernen","Bronnet moet ontwikkeld worden, waarin de Gemeente een mogelijke rol kan spelen - dit betekent nadenken over investering en financiering; haalbaarheid en potentie moet onderzocht worden; techniek is innovatief en in pilotfase, dit zorgt voor langere ontwikkeltijd. Gemeente moet nadenken over tijdspad en planning; Gemeente moet afstemmen met Waterschappen;\naanwijzen warmtebedrijf\nGemeente kan sturen op collectieve inkoop voor de individuele opwaarderingssets voor de gebouweigenaren","Warmtebedrijf/exploitant (kan Gemeente zijn):\n-\tInfrastructuur net/leidingen\n-\tOntwikkeling bron\n-\tCentrale warmtepompen en regeltechniek\n-\tOnderhoudskosten\nEindgebruiker (eventueel via Woningcorporatie/verhuurder):\n-\tAansluitkosten\n-\tIsolatiekosten om aangesloten te kunnen worden\n-\tindividuele opwaarderingssysteem (warmtepomp)\n-Gebruikskosten/warmteafname\n-\tVaste maandelijkse lasten voor onderhoud\nLet op: Uiteindelijke kostenverdeling hangt af van keuzes en governance binnen het project en kunnen in wisselende mate bij de gebruiker of het warmtebedrijf liggen","Risico-gebieden in kaart;\nRuimte elektriciteitsnet benodigde vergunningen;\npotentie bron;\nRuimte ondergrond leidingen;\nRuimte individuele warmtepomp","waterschappen;\nNetbeheerder;\nGemeentelijke afdeling ondergrond","Vanaf label c of lager verregaande isolatiemaatregelen nodig om bron te kunnen realiseren. Dit betekent niet dat dit onmogelijk is - het kan Gemeentelijk gestimuleerd worden door bijvoorbeeld collectieve inkoopacties, informeren, subsidies en een contigentenaanpak voor isolatie","Kiezen voor deze oplossing betekent een voorkeur uitspreken van een collectief systeem met individuele opwaardering.\nDit betekent energzijds gelijktijdigheid van collectiviteit, maar vraagt om investering en aanpassingen van individuele gebouweigenaar. Aquathermie vraagt doorgaans veel extra energie, dus er moet voldoende Ruimte op het net zijn.\nKiezen voor deze oplossing betekent kiezen voor een oplossingsrichting met mogelijkheid tot koeling en een piekvoorziening.\nWaterwinningsgebied kan tot restricties leiden, maar dit hoeft niet voor het hele gebied te gelden\nDaarnaast is het belangrijk om scherp te krijgen bij wie de kosten komen te liggen (zowel voor het collectieve als voor het individuele)\nKiezen voor deze oplossing betekent kiezen voor een oplossing met koelingsmogelijkheden;\nDoor de WKO kan de piekbelasting worden opgevangen en vraagt het systeem minder elektriciteit"]
["Bronnet","Thermische energie uit oppervlaktewater (TEO)","Bronnet - Thermische energie uit oppervlaktewater (TEO)",{"$f":"VLOOKUP(Tabel3[[#This Row],[Warmtebron & type net]],'A. Breakdown'!$D$3:$G$64,4,FALSE)","v":"Een bronnet op basis van oppervlaktewater aquathermie (TEO)"},"Warmte wordt onttrokken aan meren of rivieren via een warmtewisselaar en warmtepomp. Geschikt voor collectieve systemen.","\nRuimte op het elektriciteitsnet; goede isolatie; \nHoge warmtedichtheid voor betaalbaarheid; \nWaterwinning beperkt Kansrijkheid","Toepasbaar bij zowel nieuwbouw als bestaande bouw; Bij bestaande bouw zijn goede isolatie nodig","Bron op veel plaatsen aanwezig, maakt de oplossing kansrijker;\nKansrijk bij kernen met gestapelde bouw;\nKansrijk bij kernen met een hoge warmtedichtheid;\nkanrijk bij kleine tot middel (200 tot 500 weq) kernen","Bronnet moet ontwikkeld worden, waarin de Gemeente een mogelijke rol kan spelen - dit betekent nadenken over investering en financiering; haalbaarheid en potentie moet onderzocht worden; techniek is innovatief en in pilotfase, dit zorgt voor langere ontwikkeltijd. Gemeente moet nadenken over tijdspad en planning; Gemeente moet afstemmen met Waterschappen;\naanwijzen warmtebedrijf\nGemeente kan sturen op collectieve inkoop voor de individuele opwaarderingssets voor de gebouweigenaren","Warmtebedrijf/exploitant (kan Gemeente zijn):\n-\tInfrastructuur net/leidingen\n-\tOntwikkeling bron\n-\tCentrale warmtepompen en regeltechniek\n-\tOnderhoudskosten\nEindgebruiker (eventueel via Woningcorporatie/verhuurder):\n-\tAansluitkosten\n-\tIsolatiekosten om aangesloten te kunnen worden\n-\tindividuele opwaarderingssysteem (warmtepomp)\n-Gebruikskosten/warmteafname\n-\tVaste maandelijkse lasten voor onderhoud\nLet op: Uiteindelijke kostenverdeling hangt af van keuzes en governance binnen het project en kunnen in wisselende mate bij de gebruiker of het warmtebedrijf liggen","Risico-gebieden in kaart;\nRuimte elektriciteitsnet benodigde vergunningen;\npotentie bron;\nRuimte ondergrond leidingen;\nRuimte individuele warmtepomp","Waterschappen; netbeheerders; aangrenzende Gemeenten; provincie","Vanaf label c of lager verregaande isolatiemaatregelen nodig om bron te kunnen realiseren. Dit betekent niet dat dit onmogelijk is - het kan Gemeentelijk gestimuleerd worden door bijvoorbeeld collectieve inkoopacties, informeren, subsidies en een contigentenaanpak voor isolatie","Kiezen voor dit warmtesysteem op basis van een bronnet betekent kiezen voor een systeem waarbij warmte en koelte individueel geregeld kan worden. Dit betekent energzijds gelijktijdigheid van collectiviteit, maar vraagt om investering en aanpassingen van individuele gebouweigenaar;\nAquathermie vraagt doorgaans veel extra energie, dus er moet voldoende Ruimte op het net zijn. Het betekent goede afstemming en planning met de netbeheerder.\nDit systeem is enkel een oplossing voor een kleinere aantal gebouwen en kan niet alle kernen of volledige kernen bedienen. Het kan eventueel wel als onderdeel van de warmtemix worden toegepast;\nkiezen voor deze oplossingricting betekent kiezen voor een systeem dat kan koelen."]
["Bronnet","Thermische energie uit oppervlaktewater (TEO)​ + WKO","Bronnet - Thermische energie uit oppervlaktewater (TEO)​ + WKO",{"$f":"VLOOKUP(Tabel3[[#This Row],[Warmtebron & type net]],'A. Breakdown'!$D$3:$G$64,4,FALSE)","v":"Een bronnet op basis van oppervlaktewater aquathermie (TEO), inclusief WKO"},"Warmte uit oppervlaktewater wordt via een warmtewisselaar en decentrale warmtepomp benut. Dit systeem werkt op ZLT-niveau (< 25°C), maakt gebruik van een decentraal warmtepomp en levert warmte via vloerverwarming of lage temperatuur radiatoren.","Bron aanwezig;\ngeen restricties waterwinningsgebied;\nRuimte individuele opwaardering;\nRuimte ondergrond voor WKO;\nVoldoende afzet;","Kansrijk bij nieuwbouw met hoge warmtedichtheid en goede isolatie;\nBij bestaande bouw technisch complex en minder toepasbaar.","Bron is vaak beschikbaar; ook in kleinere verbanden technisch mogelijk;\nKansrijk bij midden (200 tot 500) kernen; \nKansrijk bij rijgebouwen en kleine apartementen;\nWKO zorgt voor opvang bij piekvraag","Bronnet moet ontwikkeld worden, waarin de Gemeente een mogelijke rol kan spelen - dit betekent nadenken over investering en financiering; haalbaarheid en potentie moet onderzocht worden; techniek is innovatief en in pilotfase, dit zorgt voor langere ontwikkeltijd. Gemeente moet nadenken over tijdspad en planning; Gemeente moet afstemmen met Waterschappen;\naanwijzen warmtebedrijf\nGemeente kan sturen op collectieve inkoop voor de individuele opwaarderingssets voor de gebouweigenaren","Warmtebedrijf/exploitant (kan Gemeente zijn):\n-\tInfrastructuur net/leidingen\n-\tOntwikkeling bron\n-\tCentrale warmtepompen en regeltechniek\n-\tOnderhoudskosten\nEindgebruiker (eventueel via Woningcorporatie/verhuurder):\n-\tAansluitkosten\n-\tIsolatiekosten om aangesloten te kunnen worden\n-\tindividuele opwaarderingssysteem (warmtepomp)\n-Gebruikskosten/warmteafname\n-\tVaste maandelijkse lasten voor onderhoud\nLet op: Uiteindelijke kostenverdeling hangt af van keuzes en governance binnen het project en kunnen in wisselende mate bij de gebruiker of het warmtebedrijf liggen","Risico-gebieden in kaart;\nRuimte elektriciteitsnet benodigde vergunningen;\npotentie bron;\nRuimte ondergrond leidingen;\nRuimte individuele warmtepomp","netbeheerder;\nmogelijk bewonersinitiatieven;\nbeleidsafdeling Ruimtelijke omgeving;\nbeleidsafdeling ondergrond;\nWaterschappen","Vanaf label c of lager verregaande isolatiemaatregelen nodig om bron te kunnen realiseren. Dit betekent niet dat dit onmogelijk is - het kan Gemeentelijk gestimuleerd worden door bijvoorbeeld collectieve inkoopacties, informeren, subsidies en een contigentenaanpak voor isolatie","Kiezen voor deze oplossing betekent een voorkeur uitspreken van een collectief systeem met individuele opwaardering.\nDit betekent energzijds gelijktijdigheid van collectiviteit, maar vraagt om investering en aanpassingen van individuele gebouweigenaar. Aquathermie vraagt doorgaans veel extra energie, dus er moet voldoende Ruimte op het net zijn.\nDaarnaast is het belangrijk om scherp te krijgen bij wie de kosten komen te liggen (zowel voor het collectieve als voor het individuele)\nKiezen voor deze oplossing betekent kiezen voor een oplossing met koelingsmogelijkheden;"]
["Bronnet","Warmte uit lokale restwarmte (supermarkten etc.)","Bronnet - Warmte uit lokale restwarmte (supermarkten etc.)",{"$f":"VLOOKUP(Tabel3[[#This Row],[Warmtebron & type net]],'A. Breakdown'!$D$3:$G$64,4,FALSE)","v":"Een bronnet op basis van lokale restwarmte"},"Warmte van bijvoorbeeld supermarkten of koelinstallaties wordt via een warmtenet benut voor verwarming van gebouwen.","de beschikbare warmte is vaak vrij laag; businesscase is vaak niet haalbaar zonder subsidie;","Kansrijk bij nieuwbouw nabij restwarmtebron; Bij bestaande bouw alleen toepasbaar als bron dichtbij ligt en gebouwen goed geïsoleerd zijn.","Bron is vaak beschikbaar;\nKansrijk bij kernen met gestapelde bouw;\nKansrijk bij kernen met appartementen;\nKansrijk bij rijgebouwen","Bronnet moet ontwikkeld worden, waarin de Gemeente een mogelijke rol kan spelen - dit betekent nadenken over investering en financiering; haalbaarheid en potentie moet onderzocht worden; techniek is innovatief en in pilotfase, dit zorgt voor langere ontwikkeltijd. Gemeente moet nadenken over tijdspad en planning; Gemeente moet afstemmen met eigenaren Supermarkten;\naanwijzen warmtebedrijf\nGemeente kan sturen op collectieve inkoop voor de individuele opwaarderingssets voor de gebouweigenaren","Warmtebedrijf/exploitant (kan Gemeente zijn):\n-\tInfrastructuur net/leidingen\n-\tOntwikkeling bron\n-\tCentrale warmtepompen en regeltechniek\n-\tOnderhoudskosten\nEindgebruiker (eventueel via Woningcorporatie/verhuurder):\n-\tAansluitkosten\n-\tIsolatiekosten om aangesloten te kunnen worden\n-\tindividuele opwaarderingssysteem (warmtepomp)\n-Gebruikskosten/warmteafname\n-\tVaste maandelijkse lasten voor onderhoud\nLet op: Uiteindelijke kostenverdeling hangt af van keuzes en governance binnen het project en kunnen in wisselende mate bij de gebruiker of het warmtebedrijf liggen","potentie bon; samenwerking met bedrijven; toekomstige warmteaanbod; toekomstbeeld bedrijven/levensduur bron; mogelijkheden voor collectieve inkoopacties individueel opwaardeersysteem;\nRuimte ondergrond leidingen;\nRuimte individuele warmtepomp\n","netbeheerder; lokale broneigenaren; afdeling Ruimtelijke inpassing","Vanaf label c of lager verregaande isolatiemaatregelen nodig om bron te kunnen realiseren. Dit betekent niet dat dit onmogelijk is - het kan Gemeentelijk gestimuleerd worden door bijvoorbeeld collectieve inkoopacties, informeren, subsidies en een contigentenaanpak voor isolatie","kiezen voor deze oplossingsrichting betekent een voorkeur uitspreken voor (kleinschalig) collectieve warmteoplossingen met individueel opwaardeersysteem. hierdoor biedt het systeem de mogelijkheid tot koeling. Er zijn beperkte voorbeelden van deze oplossingsrichting die zijn gerealiseerd omdat de beschikbare warmte laag uitvalt. Dit betekent niet dat de oplossing onmogelijk is voor de gebouwde omgeving, maar dat vooronderzoek nodig is. Er is mogelijk een lange ontwikkeltijd. De bron is weliswaar duurzaam, maar gebasseerd op (commerciele) bedrijven en daardoor fragieler in de levering. Het is daarom nodig om een terugvaloptie te onderzoeken."]
["Bronnet","Warmte uit lokale restwarmte (supermarkten etc.)","Bronnet - Warmte uit lokale restwarmte (supermarkten etc.)",{"$f":"VLOOKUP(Tabel3[[#This Row],[Warmtebron & type net]],'A. Breakdown'!$D$3:$G$64,4,FALSE)","v":"Een bronnet op basis van lokale restwarmte"},"Restwarmte van lokale bronnen (zoals supermarkten) wordt via een bronnet en decentrale warmtepompen benut. Dit systeem werkt op LT-niveau (25-40°C), maakt gebruik van een decentraal warmtepomp en levert warmte via vloerverwarming of lage temperatuur radiatoren.","Aanwezigheid bron;\nRuimte op het elektriciteitsnet;\nRuimte ondergrond voor systeem en leidingen;\nVoldoende isolatie;\nRuimte gebouwen voor individuele opwaardering","zowel geschikt voor nieuwbouw als voor bestaande bouw","Kansrijk bij kleine kernen (2 tot 200 weq) ;\n Kansrijk bij rijgebouwen en appartementen; slecht te isoleren gebouwen","Bronnet moet ontwikkeld worden, waarin de Gemeente een mogelijke rol kan spelen - dit betekent nadenken over investering en financiering; haalbaarheid en potentie moet onderzocht worden; techniek is innovatief en in pilotfase, dit zorgt voor langere ontwikkeltijd. Gemeente moet nadenken over tijdspad en planning; Gemeente moet afstemmen met eigenaren Supermarkten;\naanwijzen warmtebedrijf\nGemeente kan sturen op collectieve inkoop voor de individuele opwaarderingssets voor de gebouweigenaren","Warmtebedrijf/exploitant (kan Gemeente zijn):\n-\tInfrastructuur net/leidingen\n-\tOntwikkeling bron\n-\tCentrale warmtepompen en regeltechniek\n-\tOnderhoudskosten\nEindgebruiker (eventueel via Woningcorporatie/verhuurder):\n-\tAansluitkosten\n-\tIsolatiekosten om aangesloten te kunnen worden\n-\tindividuele opwaarderingssysteem (warmtepomp)\n-Gebruikskosten/warmteafname\n-\tVaste maandelijkse lasten voor onderhoud\nLet op: Uiteindelijke kostenverdeling hangt af van keuzes en governance binnen het project en kunnen in wisselende mate bij de gebruiker of het warmtebedrijf liggen","potentie bon; samenwerking met bedrijven; toekomstige warmteaanbod; toekomstbeeld bedrijven/levensduur bron; mogelijkheden voor collectieve inkoopacties individueel opwaardeersysteem;\nRuimte ondergrond leidingen;\nRuimte individuele warmtepomp\n","Eigenaren supermarkten; bewonersinitiatieven;","Vanaf label c of lager verregaande isolatiemaatregelen nodig om bron te kunnen realiseren. Dit betekent niet dat dit onmogelijk is - het kan Gemeentelijk gestimuleerd worden door bijvoorbeeld collectieve inkoopacties, informeren, subsidies en een contigentenaanpak voor isolatie","Kiezen voor deze warmteoplossing betekent een voorkeur uitspreken voor een collectief systeem met individueel opwaardering. Dit betekent energzijds gelijktijdigheid van collectiviteit, maar vraagt om investering en aanpassingen van individuele gebouweigenaar. De oplossingsrichting biedt hierdoor mogelijkheid tot koeling en een oplossing voor hittestress. Er is voldoende Ruimte op het net nodig voor het systeem en de opslag van de warmte/energie. De bron is een bedrijf, waarbij het risico bestaat dat de beschikbare warmte afneemt (door eigen verduurzaaming) of stopt (door faillisement of stoppen onderneming). Businesscase voor systeem is nog niet haalbaar."]
["Bronnet","Zonthermische panelen","Bronnet - Zonthermische panelen",{"$f":"VLOOKUP(Tabel3[[#This Row],[Warmtebron & type net]],'A. Breakdown'!$D$3:$G$64,4,FALSE)","v":"Een MT-warmtenet op basis van gedeelde zonnecollectoren met een decentrale warmtepomp"},"Panelen met vloeistof worden verwarmd door zonlicht. De warmte wordt gebruikt voor tapwater of Ruimteverwarming. Door een centraal warmtenet en decentrale warmtepomp komt het bij de woning terecht. ","Ruimte voor Zonthermische panelen;\nRuimte op het elektriciteitsnet;\nRuimte ondergrond voor systeem en leidingen;\nVoldoende isolatie;\nRuimte gebouwen voor individuele opwaardering","Toepasbaar bij zowel nieuwbouw als bestaande bouw; Bij bestaande bouw afhankelijk van Ruimte en isolatiegraad.","Een te realiseren bron;\nKansrijk bij middelgrote (500 tot 1500 weq) kernen; \nKansrijk bij rijtjesgebouwen; \nontlast elektriciteitsnet","Bronnet moet ontwikkeld worden, waarin de Gemeente een mogelijke rol kan spelen - dit betekent nadenken over investering en financiering; haalbaarheid en potentie moet onderzocht worden; techniek is innovatief en in pilotfase, dit zorgt voor langere ontwikkeltijd. Gemeente moet nadenken over tijdspad en planning; \naanwijzen warmtebedrijf\nGemeente kan sturen op collectieve inkoop voor de individuele opwaarderingssets voor de gebouweigenaren","Warmtebedrijf/exploitant (kan Gemeente zijn):\n-\tInfrastructuur net/leidingen\n-\tOntwikkeling bron\n-\tCentrale warmtepompen en regeltechniek\n-\tOnderhoudskosten\nEindgebruiker (eventueel via Woningcorporatie/verhuurder):\n-\tAansluitkosten\n-\tIsolatiekosten om aangesloten te kunnen worden\n-\tindividuele opwaarderingssysteem (warmtepomp)\n-Gebruikskosten/warmteafname\n-\tVaste maandelijkse lasten voor onderhoud\nLet op: Uiteindelijke kostenverdeling hangt af van keuzes en governance binnen het project en kunnen in wisselende mate bij de gebruiker of het warmtebedrijf liggen","Ruimte individuele warmtepomp;\nruimte ondergrond voor bronnet;\nRuimte voor termische panelen;","Grondeigenaren voor zonthermisch verld (indien mogelijk); \nbeleidsafdeling openbare Ruimte; \nBeleidsafdeling ondergrond\nNetbeheerder","Vanaf label c of lager verregaande isolatiemaatregelen nodig om bron te kunnen realiseren. Dit betekent niet dat dit onmogelijk is - het kan Gemeentelijk gestimuleerd worden door bijvoorbeeld collectieve inkoopacties, informeren, subsidies en een contigentenaanpak voor isolatie","Kiezen voor deze warmteoplossing betekent een voorkeur uitspreken voor een collectief systeem met individueel opwaardering. Dit betekent energzijds gelijktijdigheid van collectiviteit, maar vraagt om investering en aanpassingen van individuele gebouweigenaar. De oplossingsrichting biedt hierdoor mogelijkheid tot koeling. \nBronnet vraagt om individueel opwaardeersysteem en ruimte in eigen woning;\nSysteem biedt mogelijkheid tot koeling door eigen warmtepomp, maar maakt het mogelijk een duurder systeem voor het individu"]
["Individueel","Bodem-water warmtepomp","Individueel - Bodem-water warmtepomp",{"$f":"VLOOKUP(Tabel3[[#This Row],[Warmtebron & type net]],'A. Breakdown'!$D$3:$G$64,4,FALSE)","v":"Individuele bodem-waterwarmtepompen"},"Warmte wordt onttrokken uit een gesloten bodemlus en via een individuele warmtepomp geleverd. Dit systeem werkt op ZLT-niveau (< 25°C), maakt gebruik van een warmtepomp en levert warmte via vloerverwarming of lage temperatuur radiatoren.","Ruimte op elektriciteitsnet;\nVoldoende isolatie;\nVoldoende Ruimte bodem;\naanpassingen huis","Kansrijk bij nieuwbouw met Ruimte voor bodemsysteem;\nBij bestaande bouw alleen bij goede isolatie en Ruimte.","Kernen met een lage bebouwingsdichtheid; \ntoepasbaar in goedgeïsoleerde huizen;\nToepasbaar in vrijstaande gebouwen ","Gemeente kan sturen op isolatie;\nGemeente kan sturen op collectieve inkoopacties;\nGemeente heeft mogelijke rol bij vergunningverlening","Eindgebruiker (eventueel via Woningcorporatie/verhuurder):\n-\t(eventueel) bijdrage netverzwaring via belastingen\n-\tIsolatiekosten om aangesloten te kunnen worden\n-\tWarmtepomp\n-Gebruikskosten elektriciteit\n-\teventuele onderhoudskosten warmtepomp\nLet op: Uiteindelijke kostenverdeling hangt af van keuzes en governance binnen het project en kunnen in wisselende mate bij de gebruiker of het warmtebedrijf liggen","Ruimte elektriciteitsnet;\nEventuele beperkingen ondergrond;\nAanpassingen gebouw","Netbeheerders;\nVvEs en WoCo's voor eventuele collectieve regelingen;\nBeleidsafdeling Ecologie en ondergrond;","Energielabel C of lager vereist verregaande isolatiemaatregelen. Gemeente kan dit stimuleren via subsidies, collectieve inkoopacties, advies en communicatiecampagnes. LET OP: hoe hoger het energielabel/isolatie, hoe lager de elektriciteitskosten en hoe grotere energiebesparing","Kiezen voor deze warmteoplossing betekent een voorkeur uitspreken voor een oplossingsrichting die vanaf 1 aansluiting (technisch) kan worden toegepast. kiezen voor deze oplossingsrichting betekent een voorkeur uitspreken voor een individuele oplossingsrichting. Dit betekent dat het individu zelf veel vrijheid heeft, maar de Gemeente minder goed kan sturen op het tempo van de warmtetransitie;\nHoewel minder dan bij volledig elektrische warmtepompen, vraagt deze oplossingsrichting veel elektriciteit en Ruimte op het net. Elektriciteit is een schaarse bron, dat verdeeld moet worden om een landelijke en integrale warmtetransitie mogelijk te maken. Kiezen voor deze oplossingsrichting heeft mogelijk implicaties voor maatschappelijke kosten;\nKiezen voor deze oplossingsrichting betekent eventuele collectieve oplossingen lastiger te realiseren worden, in ieder geval tot dat de warmtepomp is afgeschreven (15 jaar). Het zou als tussenoplossing voor een later collectief systeem kunnen dienen.\nKiezen voor deze oplossing betekent daarnaast ook beroep doen op installateurs en monteurs, en materialen voor isolatie en de warmtepomp zelf.\nEr is voor deze oplossing geen piekvoorziening nodig"]
["Individueel","CV klimaatneutraal gas","Individueel - CV klimaatneutraal gas",{"$f":"VLOOKUP(Tabel3[[#This Row],[Warmtebron & type net]],'A. Breakdown'!$D$3:$G$64,4,FALSE)","v":"Individuele CV-ketels op basis van klimaatneutraal gas"},"Organisch materiaal wordt vergist tot biogas. Dit gas kan worden verbrand voor warmte of gebruikt in een cv-ketel.","Voldoende beschikbaar klimaatneutraalgas; geen restricties vanuit natura2000 gebied;\nBehoud gasleidingen","Niet geschikt voor nieuwbouwhuizen omdat deze gasloos gebouwd worden;\nToepasbaar in bestaande bouw met bestaande gasinfrastructuur","monumentale binnensteden zonder alternatief; Vrijstaande, oudere gebouwen;","De Gemeente heeft geen sturing op de productie van groengas;","Eindgebruiker (eventueel via Woningcorporatie/verhuurder):\n-\tAansluitkosten gasnetwerk\n-\tKosten afname gas\n-\tOnderhoud/vervanging CV\nLet op: Uiteindelijke kostenverdeling hangt af van keuzes en governance binnen het project en kunnen in wisselende mate bij de gebruiker of het warmtebedrijf liggen","Beschikbaarheid klimaatneutraal gas; aanpassingen leidingen en gebouwen","Producenten klimaatneutraal gas/biovergisters;\nlandelijke overheid;","Geen beperkingen. LET OP: hoe hoger het energielabel/isolatie, hoe lager de elektriciteitskosten en hoe grotere energiebesparing","Kiezen voor deze oplossingsrichting betekent een voorkeur uitspreken voor een individuele oplossingsrichting.\nDe oplossingsrichting is afhankelijk van klimaatneutraal gas en de beschikbaarheid hiervan om duurzaam te zijn. Dit is nog onzeker in de toekomst en de Gemeente heeft hier geen regie over;\nDaarnaast richt deze oplossingsrichting zich op het transitietempo van de individu, waardoor de transitie naar aardgasvrij lastiger te plannen en in te schatten is.\nKiezen voor deze oplossingsrichting betekent dat inwoners hun gebouwen tot een minder hoog isolatieniveau hoeven te isoleren.\nEen andere consequentie is bij het kiezen van deze oplossingsrichting dat eventuele collectieve oplossingen lastiger te realiseren worden, in ieder geval tot dat de warmtepomp is afgeschreven (15 jaar). Het zou als tussenoplossing voor een later collectief systeem kunnen dienen. Om deze oplossingrichting te realiseren, is het aan te raden na te gaan of er voldoende Ruimte op het net.\nKiezen voor deze oplossing betekent daarnaast ook beroep doen op installateurs en monteurs, en materialen voor isolatie en de warmtepomp zelf.\nEr is voor deze oplossing geen piekvoorziening nodig"]
["Individueel","Elektrische warmte","Individueel - Elektrische warmte",{"$f":"VLOOKUP(Tabel3[[#This Row],[Warmtebron & type net]],'A. Breakdown'!$D$3:$G$64,4,FALSE)","v":"Individuele elektrische warmtepompen"},"Elektrische verwarming via radiatoren of infraroodpanelen. Geen warmtepomp, directe omzetting van stroom naar warmte. Dit systeem werkt op MT-niveau (40-75°C) en levert warmte via radiatoren of convectoren.","Goede isolatie;\nRuimte elektriciteitsnet\nVoldoende Ruimte systeem in huis","Kansrijk bij goed geïsoleerde nieuwbouwgebouwen; \nBij bestaande bouw alleen geschikt na isolatiemaatregelen.","Kernen met een lage bebouwingsdichtheid;\nmoeilijk te isoleren gebouwen;\nvrijstaande monumentale panden;\ntoepasbaar in goedgeïsoleerde huizen.","Gemeente kan sturen op isolatie; \nGemeente kan sturen op collectieve inkoopacties;","Eindgebruiker (eventueel via Woningcorporatie/verhuurder):\n-\t(eventueel) bijdrage netverzwaring via belastingen\n-\tIsolatiekosten om aangesloten te kunnen worden\n-\tVerwarmingssystemen\n-Gebruikskosten elektriciteit\n-\teventuele onderhoudskosten warmtepomp\nLet op: Uiteindelijke kostenverdeling hangt af van keuzes en governance binnen het project en kunnen in wisselende mate bij de gebruiker of het warmtebedrijf liggen","Ruimte op het elektriciteitsnet;\n","Netbeheerders;\nVvEs en WoCo's voor eventuele collectieve regelingen;","Energielabel D of lager vereist verregaande isolatiemaatregelen. Gemeente kan dit stimuleren via subsidies, collectieve inkoopacties, advies en communicatiecampagnes. LET OP: hoe hoger het energielabel/isolatie, hoe lager de elektriciteitskosten en hoe grotere energiebesparing","Kiezen voor deze oplossingsrichting betekent een voorkeur uitspreken voor een individuele oplossingsrichting.\nOplossing vraagt veel elektriciteit, waardoor het kan leiden tot zware netverzwaring/hoge maatschappelijke kosten die bij alle inwoners worden belegt;\nKiezen voor deze oplossingsrichting betekent eventuele collectieve oplossingen lastiger te realiseren worden, in ieder geval tot dat het systeem en de apparaten zijn afgeschreven. Het zou als tussenoplossing voor een later collectief systeem kunnen dienen.\nDaarnaast richt deze oplossingsrichting zich op het transitietempo van de individu, waardoor de transitie naar aardgasvrij lastiger te plannen en in te schatten is.\nKiezen voor deze oplossingsrichting betekent dat inwoners hun gebouwen tot een minder hoog isolatieniveau hoeven te isoleren.\nEen andere consequentie is bij het kiezen van deze oplossingsrichting dat eventuele collectieve oplossingen lastiger te realiseren worden, in ieder geval tot dat de warmtepomp is afgeschreven (15 jaar). Het zou als tussenoplossing voor een later collectief systeem kunnen dienen. Om deze oplossingrichting te realiseren, is het aan te raden na te gaan of er voldoende Ruimte op het net.\nKiezen voor deze oplossing betekent daarnaast ook beroep doen op installateurs en monteurs, en materialen voor isolatie en de warmtepomp zelf.\nEr is voor deze oplossing geen piekvoorziening nodig"]
["Individueel","Gesloten bodemenergie​","Individueel - Gesloten bodemenergie​",{"$f":"VLOOKUP(Tabel3[[#This Row],[Warmtebron & type net]],'A. Breakdown'!$D$3:$G$64,4,FALSE)","v":"Individuele gesloten bodemenergie systemen/bodemlus (WKO)"},"Gesloten bodemlussen leveren warmte aan een warmtepomp. Dit systeem werkt op LT niveau (25-55°C) en levert warmte via vloerverwarming, lage temperatuur radiatoren of convectoren.","Ruimte in de ondergrond;\ngeen juridische restricties;","Kansrijk bij nieuwbouw;\nBij bestaande bouw alleen bij Voldoende Ruimte in ondergrond.","Kansrijk bij nieuwbouwhuizen;\nKansrijk bij vrijstaande gebouwen","Gemeente kan sturen op isolatie;\nGemeente kan sturen op collectieve inkoopacties\nDe Gemeente is vaak bevoegd gezag verlening van vergunningen","Eindgebruiker (eventueel via Woningcorporatie/verhuurder):\n-\t(eventueel) bijdrage netverzwaring via belastingen\n-\tIsolatiekosten om aangesloten te kunnen worden\n-\tWarmtepomp\n- Kosten systeem\n-Gebruikskosten elektriciteit\n-\teventuele onderhoudskosten warmtepomp\nLet op: Uiteindelijke kostenverdeling hangt af van keuzes en governance binnen het project en kunnen in wisselende mate bij de gebruiker of het warmtebedrijf liggen","restricties waterwinningsgebied (indien van toepassing);\nrestricties ondergrond;\naanpassingen gebouwen;\ninvesteringskosten","Beleidsafdeling ondergrond;\nomgevingsdienst;\nbewonersinitiatieven","Energielabel d of lager vereist aanvullende isolatiemaatregelen. Gemeente kan dit stimuleren via subsidies, collectieve inkoopacties en advies. LET OP: hoe hoger het energielabel/isolatie, hoe lager de elektriciteitskosten en hoe grotere energiebesparing","Kiezen voor deze warmteoplossing betekent een voorkeur uitspreken voor een oplossingsrichting die vanaf 1 aansluiting (technisch) kan worden toegepast. kiezen voor deze oplossingsrichting betekent een voorkeur uitspreken voor een individuele oplossingsrichting. Dit betekent dat het individu zelf veel keuzevrijheid heeft, maar de Gemeente minder goed kan sturen op het tempo van de warmtetransitie;\nHoewel minder dan bij volledig elektrische warmtepompen, vraagt deze oplossingsrichting veel elektriciteit en Ruimte op het net. Elektriciteit is een schaarse bron, dat verdeeld moet worden om een landelijke en integrale warmtetransitie mogelijk te maken. Kiezen voor deze oplossingsrichting heeft mogelijk implicaties voor maatschappelijke kosten;\nKiezen voor deze oplossingsrichting betekent eventuele collectieve oplossingen lastiger te realiseren worden, in ieder geval tot dat de warmtepomp is afgeschreven (15 jaar). Het zou als tussenoplossing voor een later collectief systeem kunnen dienen.\nKiezen voor deze oplossing betekent daarnaast ook beroep doen op installateurs en monteurs, en materialen voor isolatie en de warmtepomp zelf.\nEr is voor deze oplossing geen piekvoorziening nodig"]
["Individueel","Hybride warmtepomp","Individueel - Hybride warmtepomp",{"$f":"VLOOKUP(Tabel3[[#This Row],[Warmtebron & type net]],'A. Breakdown'!$D$3:$G$64,4,FALSE)","v":"Individuele hybride warmtepompen"},"Combinatie van een warmtepomp en een cv-ketel. Warmtepomp levert MT, ketel springt bij voor piekvraag. Dit systeem werkt op MT-niveau (40-75°C), maakt gebruik van een warmtepomp en levert warmte via radiatoren of convectoren.","Beschikbaarheid van klimaatneutraal gas;","Minder geschikt bij nieuwbouw doordat deze gebouwen gasloos zijn;\ngeschikt voor bestaande bouw","Kernen met een lage bebouwingsdichtheid;\nmoeilijk te isoleren gebouwen; vrijstaande monumentale panden;\ntoepasbaar in goedgeïsoleerde huizen.","Gemeente kan sturen op isolatie;\nGemeente kan sturen op collectieve inkoopacties\nGemeente heeft geen invloed op beschikbaarheid groen gas, tenzij specifieke afspraken","Eindgebruiker (eventueel via Woningcorporatie/verhuurder):\n-\t(eventueel) bijdrage netverzwaring via belastingen\n-\tAansluiting gasnetwerk\n-\tWarmtepomp\n-Gebruikskosten elektriciteit\n-\teventuele onderhoudskosten warmtepomp\nLet op: Uiteindelijke kostenverdeling hangt af van keuzes en governance binnen het project en kunnen in wisselende mate bij de gebruiker of het warmtebedrijf liggen","Beschikbaarheid Groen gas (op termijn) of alternatieve duurzame bron;\nVolledig duurzaam alternatief","Netbeheerders;\nVvEs en WoCo's voor eventuele collectieve regelingen;;","Energielabel E of lager vereist isolatiemaatregelen. Gemeente kan dit stimuleren via subsidies, collectieve inkoopacties, advies en communicatiecampagnes. LET OP: hoe hoger het energielabel/isolatie, hoe lager de elektriciteitskosten en hoe grotere energiebesparing","Kiezen voor deze warmteoplossing betekent een voorkeur uitspreken voor een oplossingsrichting die vanaf 1 aansluiting (technisch) kan worden toegepast. kiezen voor deze oplossingsrichting betekent een voorkeur uitspreken voor een individuele oplossingsrichting.\nHoewel minder dan bij volledig elektrische warmtepompen, vraagt deze oplossingsrichting veel elektriciteit en Ruimte op het net. Elektriciteit is een schaarse bron, dat verdeeld moet worden om een landelijke en integrale warmtetransitie mogelijk te maken.\nDaarnaast richt deze oplossingsrichting zich op het transitietempo van de individu, waardoor de transitie naar aardgasvrij lastiger te plannen en in te schatten is.\nOm volledige duurzaam te zijn, dient het gas klimaatneutraal te zijn. De beschikbaarheid in de toekomst is onzeker en Gemeenten hebben hier geen regie over\nEen andere consequentie is bij het kiezen van deze oplossingsrichting dat eventuele collectieve oplossingen lastiger te realiseren worden, in ieder geval tot dat de warmtepomp is afgeschreven (15 jaar). Het zou als tussenoplossing voor een later collectief systeem kunnen dienen. Om deze oplossingrichting te realiseren, is het aan te raden na te gaan of er voldoende Ruimte op het net.\nKiezen voor deze oplossing betekent daarnaast ook beroep doen op installateurs en monteurs, en materialen voor isolatie en de warmtepomp zelf."]
["Individueel","Lucht/lucht warmtepomp","Individueel - Lucht/lucht warmtepomp",{"$f":"VLOOKUP(Tabel3[[#This Row],[Warmtebron & type net]],'A. Breakdown'!$D$3:$G$64,4,FALSE)","v":"Individuele lucht-lucht warmtepompen"},"Buitenlucht wordt gebruikt als bron voor een warmtepomp die via luchtcirculatie verwarmt. Dit systeem werkt op ZLT-niveau (< 25°C), maakt gebruik van een warmtepomp en levert warmte via vloerverwarming of lage temperatuur radiatoren.","hoge isolatiegraad;\nVoldoende Ruimte voor systeem;","Kansrijk bij zeer goed geïsoleerde nieuwbouwgebouwen; Bij bestaande bouw alleen geschikt na isolatiemaatregelen.","Kernen met een lage bebouwingsdichtheid; kernen met veel Ruimte op het elektriciteitsnet;","Gemeente kan sturen op isolatie; \nGemeente kan sturen op collectieve inkoopacties;","Eindgebruiker (eventueel via Woningcorporatie/verhuurder):\n-\t(eventueel) bijdrage netverzwaring via belastingen\n-\tIsolatiekosten om aangesloten te kunnen worden\n-\tluchtcirculatiesysteem\n- Kosten systeem\n-Gebruikskosten elektriciteit\n-\teventuele onderhoudskosten warmtepomp\nLet op: Uiteindelijke kostenverdeling hangt af van keuzes en governance binnen het project en kunnen in wisselende mate bij de gebruiker of het warmtebedrijf liggen","Ruimte op het elektriciteitsnet;\nisolatiemogelijkheden;\nEcologische overlast (geluid)","Netbeheerders;\nVvEs en WoCo's voor eventuele collectieve regelingen;\nbeleidsafdeling Ecologie en omgevingsmanagement","Direct toepasbaar bij energielabel A en B, daaronder is een flinke investering nodig om de bron betaalbaar toe te passen. LET OP: hoe hoger het energielabel/isolatie, hoe lager de elektriciteitskosten en hoe grotere energiebesparing.","Kiezen voor deze oplossingsrichting betekent een voorkeur uitspreken voor een individuele oplossingsrichting. Dit betekent dat het individu zelf veel keuzevrijheid heeft, maar de Gemeente minder goed kan sturen op het tempo van de warmtetransitie;\nHoewel iets minder dan bij volledig elektrische warmtepompen, vraagt deze oplossingsrichting veel elektriciteit en Ruimte op het net. Elektriciteit is een schaarse bron, dat verdeeld moet worden om een landelijke en integrale warmtetransitie mogelijk te maken. Kiezen voor deze oplossingsrichting heeft mogelijk implicaties voor maatschappelijke kosten;\nKiezen voor deze oplossingsrichting betekent eventuele collectieve oplossingen lastiger te realiseren worden, in ieder geval tot dat de warmtepomp is afgeschreven (15 jaar). Het zou als tussenoplossing voor een later collectief systeem kunnen dienen.\nKiezen voor deze oplossing betekent daarnaast ook beroep doen op installateurs en monteurs, en materialen voor isolatie en de warmtepomp zelf.\nKiezen voor deze oplossing betekent dat er veel kosten bij de individu komen te liggen indien de Gemeente geen regelingen optuigt. Dit kan invloed hebben op energierechtvaardigheid\nEr is voor deze oplossing geen piekvoorziening nodig"]
["Individueel","Lucht/water Warmtepomp​","Individueel - Lucht/water Warmtepomp​",{"$f":"VLOOKUP(Tabel3[[#This Row],[Warmtebron & type net]],'A. Breakdown'!$D$3:$G$64,4,FALSE)","v":"Individuele lucht-water warmtepompen"},"Onthoudt warmte uit buitenlucht en gebruikt dit om via een warmtepomp water te verwarmen voor radiatoren of vloerverwarming.","Ruimte op elektriciteitsnet;\nisolatie;","Kansrijk bij goed geïsoleerde nieuwbouwgebouwen;\nBij bestaande bouw alleen geschikt na isolatiemaatregelen.","Kernen met een lage bebouwingsdichtheid;\ntoepasbaar in goedgeïsoleerde huizen.","Gemeente kan sturen op isolatie;\nGemeente kan sturen op collectieve inkoopacties;\nGemeente kan ondersteunen met haalbaarheidsonderzoeken en vergunningen","Eindgebruiker (eventueel via Woningcorporatie/verhuurder):\n-\t(eventueel) bijdrage netverzwaring via belastingen\n-\tIsolatiekosten om aangesloten te kunnen worden\n-\tWarmtepomp\n- Kosten systeem\n-Gebruikskosten elektriciteit\n-\teventuele onderhoudskosten warmtepomp\nLet op: Uiteindelijke kostenverdeling hangt af van keuzes en governance binnen het project en kunnen in wisselende mate bij de gebruiker of het warmtebedrijf liggen","Ruimte op het elektriciteitsnet;\npotentieel geluidsoverlast;\nbeschikbaarheid installateurs","De impact op het elektriciteitsnet/invloed op netcongestie is hoog, waardoor afstemming met netbeheerder nodig is.","Energielabel C of lager vereist aanvullende isolatiemaatregelen. Gemeente kan dit stimuleren via subsidies, collectieve inkoopacties en maatwerkadvies. LET OP: hoe hoger het energielabel/isolatie, hoe lager de elektriciteitskosten en hoe grotere energiebesparing","Kiezen voor deze oplossingsrichting betekent een voorkeur uitspreken voor een individuele oplossingsrichting. Dit betekent dat het individu zelf veel keuzevrijheid heeft, maar de Gemeente minder goed kan sturen op het tempo van de warmtetransitie;\nHoewel iets minder dan bij volledig elektrische warmtepompen, vraagt deze oplossingsrichting veel elektriciteit en Ruimte op het net. Elektriciteit is een schaarse bron, dat verdeeld moet worden om een landelijke en integrale warmtetransitie mogelijk te maken. Kiezen voor deze oplossingsrichting heeft mogelijk implicaties voor maatschappelijke kosten;\nKiezen voor deze oplossingsrichting betekent eventuele collectieve oplossingen lastiger te realiseren worden, in ieder geval tot dat de warmtepomp is afgeschreven (15 jaar). Het zou als tussenoplossing voor een later collectief systeem kunnen dienen.\nKiezen voor deze oplossing betekent daarnaast ook beroep doen op installateurs en monteurs, en materialen voor isolatie en de warmtepomp zelf.\nKiezen voor deze oplossing betekent dat er veel kosten bij de individu komen te liggen indien de Gemeente geen regelingen optuigt. Dit kan invloed hebben op energierechtvaardigheid\nEr is voor deze oplossing geen piekvoorziening nodig"]
["Individueel","Open bodemenergie","Individueel - Open bodemenergie",{"$f":"VLOOKUP(Tabel3[[#This Row],[Warmtebron & type net]],'A. Breakdown'!$D$3:$G$64,4,FALSE)","v":"Individuele open bodemenergie systemen (WKO)"},"Warmte wordt onttrokken uit grondwater en geleverd via een individuele warmtepomp. Dit systeem werkt op ZLT-niveau (< 25°C), maakt gebruik van een warmtepomp en levert warmte via vloerverwarming of lage temperatuur radiatoren.","Ruimte op elektriciteitsnet;\nisolatie;\nRuimte ondergrond","Kansrijk bij goed geïsoleerde nieuwbouwgebouwen;\nBij bestaande bouw alleen geschikt na isolatiemaatregelen.","Kernen met een lage bebouwingsdichtheid;\ntoepasbaar in goedgeïsoleerde huizen.","Gemeente kan sturen op isolatie; Gemeente kan sturen op collectieve inkoopacties;\nGemeente kan ondersteunen met haalbaarheidsonderzoeken en vergunningen","Eindgebruiker (eventueel via Woningcorporatie/verhuurder):\n-\t(eventueel) bijdrage netverzwaring via belastingen\n-\tIsolatiekosten om aangesloten te kunnen worden\n-\tWarmtepomp\n- Kosten systeem\n-Gebruikskosten elektriciteit\n-\teventuele onderhoudskosten warmtepomp\nLet op: Uiteindelijke kostenverdeling hangt af van keuzes en governance binnen het project en kunnen in wisselende mate bij de gebruiker of het warmtebedrijf liggen","Ruimte op het elektriciteitsnet;\nisolatiemogelijkheden;\nbeschikbaarheid installateurs","Netbeheerder;\nBeleidsafdeling ondergrond","Energielabel C of lager vereist aanvullende isolatiemaatregelen. Gemeente kan dit stimuleren via subsidies, collectieve inkoopacties en maatwerkadvies. LET OP: hoe hoger het energielabel/isolatie, hoe lager de elektriciteitskosten en hoe grotere energiebesparing","Kiezen voor deze oplossingsrichting betekent een voorkeur uitspreken voor een individuele oplossingsrichting. Dit betekent dat het individu zelf veel keuzevrijheid heeft, maar de Gemeente minder goed kan sturen op het tempo van de warmtetransitie;\nHoewel  minder dan bij volledig elektrische warmtepompen, vraagt deze oplossingsrichting veel elektriciteit en Ruimte op het net. Elektriciteit is een schaarse bron, dat verdeeld moet worden om een landelijke en integrale warmtetransitie mogelijk te maken. Kiezen voor deze oplossingsrichting heeft mogelijk implicaties voor maatschappelijke kosten;\nKiezen voor deze oplossingsrichting betekent eventuele collectieve oplossingen lastiger te realiseren worden, in ieder geval tot dat de warmtepomp is afgeschreven (15 jaar). Het zou als tussenoplossing voor een later collectief systeem kunnen dienen.\nKiezen voor deze oplossing betekent daarnaast ook beroep doen op installateurs en monteurs, en materialen voor isolatie en de warmtepomp zelf.\nKiezen voor deze oplossing betekent dat er veel kosten bij de individu komen te liggen indien de Gemeente geen regelingen optuigt. Dit kan invloed hebben op energierechtvaardigheid\nEr is voor deze oplossing geen piekvoorziening nodig"]
["Individueel","PVT","Individueel - PVT",{"$f":"VLOOKUP(Tabel3[[#This Row],[Warmtebron & type net]],'A. Breakdown'!$D$3:$G$64,4,FALSE)","v":"Individuele PVT-panelen"},"PVT-panelen leveren thermische energie direct aan een individuele warmtepomp en/of buffervat. Dit systeem werkt op LT-niveau (25-40°C), maakt gebruik van een warmtepomp en levert warmte via vloerverwarming of lage temperatuur radiatoren.","Hoge isolatiegraad;\nVoldoende Ruimte voor systeem","Kansrijk bij goed geïsoleerde nieuwbouwgebouwen;\nBij bestaande bouw alleen geschikt na redelijke isolatiemaatregelen.","Kansrijk bij kernen met een lage bebouwingsdichtheid;\nToepasbaar in goedgeïsoleerde huizen.","Gemeente kan sturen op isolatie;\nGemeente kan sturen op collectieve inkoopacties;","Eindgebruiker (eventueel via Woningcorporatie/verhuurder):\n-\t(eventueel) bijdrage netverzwaring via belastingen\n-\tIsolatiekosten om aangesloten te kunnen worden\n-\tWarmtepomp/buffervat\n- Kosten systeem\n-Gebruikskosten elektriciteit\n-\teventuele onderhoudskosten warmtepomp\nLet op: Uiteindelijke kostenverdeling hangt af van keuzes en governance binnen het project en kunnen in wisselende mate bij de gebruiker of het warmtebedrijf liggen","Ruimte op het elektriciteitsnet;\nbeschikbaarheid installateurs","Netbeheerders;\nVvEs en WoCo's voor eventuele collectieve regelingen;","Energielabel D of lager vereist aanvullende isolatiemaatregelen. Gemeente kan dit stimuleren via subsidies, collectieve inkoopacties en maatwerkadvies. LET OP: hoe hoger het energielabel/isolatie, hoe lager de elektriciteitskosten en hoe grotere energiebesparing","Kiezen voor deze oplossingsrichting betekent een voorkeur uitspreken voor een individuele oplossingsrichting. Dit betekent dat het individu zelf veel keuzevrijheid heeft, maar de Gemeente minder goed kan sturen op het tempo van de warmtetransitie;\nHoewel iets minder dan bij volledig elektrische warmtepompen, vraagt deze oplossingsrichting veel elektriciteit en Ruimte op het net. Elektriciteit is een schaarse bron, dat verdeeld moet worden om een landelijke en integrale warmtetransitie mogelijk te maken. Kiezen voor deze oplossingsrichting heeft mogelijk implicaties voor maatschappelijke kosten;\nKiezen voor deze oplossingsrichting betekent eventuele collectieve oplossingen lastiger te realiseren worden, in ieder geval tot dat de warmtepomp is afgeschreven (15 jaar). Het zou als tussenoplossing voor een later collectief systeem kunnen dienen.\nKiezen voor deze oplossing betekent daarnaast ook beroep doen op installateurs en monteurs, en materialen voor isolatie en de warmtepomp zelf.\nKiezen voor deze oplossing betekent dat er veel kosten bij de individu komen te liggen indien de Gemeente geen regelingen optuigt. Dit kan invloed hebben op energierechtvaardigheid\nEr is voor deze oplossing geen piekvoorziening nodig"]
["Individueel","Waterstof​","Individueel - Waterstof​",{"$f":"VLOOKUP(Tabel3[[#This Row],[Warmtebron & type net]],'A. Breakdown'!$D$3:$G$64,4,FALSE)","v":{"$error":"#N/A"}},"Waterstof wordt verbrand of via een brandstofcel omgezet in warmte. Nog in ontwikkeling voor gebouwende omgeving.","grote afzet;\nveiligheid; opslag;\nRuimte voor opwek;\nlogistiek en transportsysteem;\naangepaste leidingen","Niet geschikt voor reguliere nieuwbouw of bestaande bouw; toepassing beperkt tot industrie.","De kansen voor groene waterstof liggen met name in de grootschalige industrie en mobiliteit.","De toepassing van waterstof als warmteoplossing voor de gebouwde omgeving is niet aan te raden. Groene waterstof is schaars, duur en kan gevaarlijk zijn. Daarnaast kan het voor veel andere processen worden gebruikt, terwijl er voor de gebouwde omgeving meer logische oplossingen zijn.","Nvt","opwekking waterstof mogelijkheden;\ntoepasbaarheid gebouwde omgeving","Nationale overheid;\nomgevingsdiensten; Waterstof Nederland","Geen beperkingen. LET OP: hoe hoger het energielabel/isolatie, hoe lager de elektriciteitskosten en hoe grotere energiebesparing","Kiezen voor deze oplossingsrichting is waarschijnlijk enkel mogelijk voor de zware industrie. Gemeenten hebben zeer beperkte mogelijkheden om te sturen op deze oplossingsrichting;\nKiezen voor deze oplossingsrichting betekent dat de Gemeente sterk afhankelijk blijft van (inter)nationale ontwikkelingen en weinig eigen sturing heeft op de warmtetransitie."]
["Individueel","zonnecollectoren","Individueel - zonnecollectoren",{"$f":"VLOOKUP(Tabel3[[#This Row],[Warmtebron & type net]],'A. Breakdown'!$D$3:$G$64,4,FALSE)","v":"Individuele zonnecollectoren"},"Zonthermische energie wordt via individuele zonnecollectoren direct geleverd aan een gebouwgebonden systeem. Dit systeem werkt op LT-niveau (lage temperatuur, ca. 45°C) en levert warmte via vloerverwarming of lage temperatuur radiatoren.","Ruimte voor collectoren;\nRuimte systeem","Kansrijk bij goed geïsoleerde nieuwbouwgebouwen;\nBij bestaande bouw alleen geschikt na redelijke isolatiemaatregelen.","Kernen met een lage bebouwingsdichtheid;\ntoepasbaar in goedgeïsoleerde huizen.","Gemeente kan sturen op isolatie;\nGemeente kan sturen op collectieve inkoopacties;","Eindgebruiker (eventueel via Woningcorporatie/verhuurder):\n-\t(eventueel) bijdrage netverzwaring via belastingen\n-\tIsolatiekosten om aangesloten te kunnen worden\n-\tWarmtepomp\n- Kosten systeem\n-Gebruikskosten elektriciteit\n-\teventuele onderhoudskosten warmtepomp\nLet op: Uiteindelijke kostenverdeling hangt af van keuzes en governance binnen het project en kunnen in wisselende mate bij de gebruiker of het warmtebedrijf liggen","Ruimte op het elektriciteitsnet;\nisolatiemogelijkheden;\nbeschikbaarheid installateurs","Netbeheerders;\nVvEs en WoCo's voor eventuele collectieve regelingen;","Energielabel D of lager vereist aanvullende isolatiemaatregelen. Gemeente kan dit stimuleren via subsidies, collectieve inkoopacties en maatwerkadvies. LET OP: hoe hoger het energielabel/isolatie, hoe lager de elektriciteitskosten en hoe grotere energiebesparing","Kiezen voor deze oplossingsrichting betekent een voorkeur uitspreken voor een individuele oplossingsrichting. Dit betekent dat het individu zelf veel keuzevrijheid heeft, maar de Gemeente minder goed kan sturen op het tempo van de warmtetransitie;\nHoewel iets minder dan bij volledig elektrische warmtepompen, vraagt deze oplossingsrichting veel elektriciteit en Ruimte op het net. Elektriciteit is een schaarse bron, dat verdeeld moet worden om een landelijke en integrale warmtetransitie mogelijk te maken. Kiezen voor deze oplossingsrichting heeft mogelijk implicaties voor maatschappelijke kosten;\nKiezen voor deze oplossingsrichting betekent eventuele collectieve oplossingen lastiger te realiseren worden, in ieder geval tot dat de warmtepomp is afgeschreven (15 jaar). Het zou als tussenoplossing voor een later collectief systeem kunnen dienen.\nKiezen voor deze oplossing betekent daarnaast ook beroep doen op installateurs en monteurs, en materialen voor isolatie en de warmtepomp zelf.\nKiezen voor deze oplossing betekent dat er veel kosten bij de individu komen te liggen indien de Gemeente geen regelingen optuigt. Dit kan invloed hebben op energierechtvaardigheid\nEr is voor deze oplossing geen piekvoorziening nodig"]
["Warmtenet","Asfaltthermie - Thermische panelen in de weg​ (WKO)","Warmtenet - Asfaltthermie - Thermische panelen in de weg​ (WKO)",{"$f":"VLOOKUP(Tabel3[[#This Row],[Warmtebron & type net]],'A. Breakdown'!$D$3:$G$64,4,FALSE)","v":"Een LT-warmtenet op basis van asfaltthermie, inclusief WKO"},"Asfaltpanelen leveren warmte aan een WKO-buffer, dat via een centrale warmtepomp in het warmtenet wordt verspreid. Dit systeem werkt op LT-niveau (25-40°C), maakt gebruik van een centrale warmtepomp en levert warmte via vloerverwarming of lage temperatuur radiatoren.","Goede isolatie (A-C); piekvoorziening nodig; Voldoende warmtedichtheid; Asfalt aanwezig; Waterwinninggebied vraagt om extra onderzoek; piekvoorziening","Kansrijk bij nieuwbouwprojecten met nog aan te leggen asfalt; \nBij bestaande bouw alleen bij herinrichting.","Bron is in veel gebieden aanwezig;\nKansrijk bij midden (200 tot 500 weq) kernen; \nKansrijk bij woonwijken met rijgebouwen of gestapelde bouw;","Techniek is zeer innovatief en wordt weinig toegepast - dit vraagt aanvullend onderzoek;\nWarmtenet moet ontwikkeld worden, waarin de Gemeente een mogelijke rol kan spelen - dit betekent nadenken over investering en financiering; haalbaarheid en potentie moet onderzocht worden; techniek is innovatief en in pilotfase, dit zorgt voor langere ontwikkeltijd. Gemeente moet nadenken over tijdspad en planning; Gemeente moet afstemmen met eigenaren asfalt/provincie en RWS over mogelijkheden; aanwijzen warmtebedrijf","Warmtebedrijf/exploitant (kan Gemeente zijn):\n-\tInfrastructuur net/leidingen\n-\tOntwikkeling bron\n-\tCentrale warmtepompen en regeltechniek\n-\tOnderhoudskosten\nEindgebruiker (eventueel via Woningcorporatie/verhuurder):\n-\tAansluitkosten\n-\t(eventuele) Isolatiekosten om aangesloten te kunnen worden\n-Gebruikskosten/warmteafname\n-\tVaste maandelijkse lasten voor onderhoud\nLet op: Uiteindelijke kostenverdeling hangt af van keuzes en governance binnen het project en kunnen in wisselende mate bij de gebruiker of het warmtebedrijf liggen","Oplossing voor piekvoorziening;\nPotentie systeem; \nOntwikkelkosten; \nmogelijkheden provincie en RWS; \nPlanning voor renovaties;\nAanpassingen gebouw\n","Provincie; \nRWS;\nOmgeving en inwoners;\nBeleidsafdeling Ondergrond;","Vanaf energielabel C zijn aanvullende isolatiemaatregelen nodig. Gemeente kan dit stimuleren via collectieve inkoopacties en subsidies. LET OP: hoe hoger het energielabel/isolatie, hoe lager de elektriciteitskosten en hoe grotere energiebesparing","Kiezen voor deze warmteoplossing betekent een voorkeur uitspreken voor een kleinschalige collectieve oplossing die integratie met infrastructuur vereist.\nSysteem biedt mogelijkheid om een deel van de Gemeente in een keer aardgasvrij te maken.\nDe techniek is nog in ontwikkeling en vraagt om opslag en back-up. Daarnaast levert dit systeem alleen nog geen oplossing voor piekmomenten, hier moet verder onderzoek naar worden gedaan\nGemeente moet afstemmen met wegbeheer en investeren in innovatie. Daarnaast ontstaat er complexiteit door afhankelijkheid van externe partners en vervangings- en herstelcycli wegdek.\nDeze oplossing biedt beperkte mogelijkheid tot koeling. Bij deze oplossingsrichting is een piekvoorziening nodig bij hoge warmtevraag (bijvoorbeeld koude dagen) - kiezen voor deze oplossing betekent dat hierover nagedacht moet worden (back up ketel bijvoorbeeld)"]
["Warmtenet","Collectieve lucht-water warmtepomp","Warmtenet - Collectieve lucht-water warmtepomp",{"$f":"VLOOKUP(Tabel3[[#This Row],[Warmtebron & type net]],'A. Breakdown'!$D$3:$G$64,4,FALSE)","v":"Een MT-warmtenet op basis van een collectieve lucht-water warmtepomp"},"Een Buurt Energie Systeem (BES) waarbij een nabijgelegen bron opgewaardeerd wordt via een collectieve lucht-water warmtepomp en levert aan een warmtenet. Dit systeem werkt op middeltemperatuur (45–75°C), maakt gebruik van een centrale warmtepompinstallatie en levert warmte aan gebouwen via convectoren.","Ruimte op het elektriciteitsnet voor opwaardering basisbron;\nVoldoende isolatie;\nRuimte ondergrond voor warmtenet","Minder geschikt voor nieuwbouw door hoge isolatiegraad gebouwen;\nKansrijk bij bestaande bouw indien mogelijkheden voor isolatie","Kansrijk bij midden (200 tot 500 weq) kernen; \nKansrijk bij rijgebouwen en appartementen; \nKansrijk bij slecht te isoleren gebouwen","Warmtenet moet ontwikkeld worden, waarin de Gemeente een mogelijke rol kan spelen - dit betekent nadenken over investering en financiering;\nhaalbaarheid en potentie moet onderzocht worden;\ntechniek is innovatief en in pilotfase, dit zorgt voor langere ontwikkeltijd. Gemeente moet nadenken over tijdspad en planning;\nGemeente moet afstemmen met ontwikkelaar systeem;\nGemeente moet warmtebedrijf aanwijzen of vrijstelling verlenen","Warmtebedrijf/exploitant (kan Gemeente zijn):\n-\tInfrastructuur net/leidingen\n-\tOntwikkeling bron\n-\tCentrale warmtepompen en regeltechniek\n-\tOnderhoudskosten\nEindgebruiker (eventueel via Woningcorporatie/verhuurder):\n-\tAansluitkosten\n-\t(eventuele) Isolatiekosten om aangesloten te kunnen worden\n-Gebruikskosten/warmteafname\n-\tVaste maandelijkse lasten voor onderhoud\nLet op: Uiteindelijke kostenverdeling hangt af van keuzes en governance binnen het project en kunnen in wisselende mate bij de gebruiker of het warmtebedrijf liggen","\nOplossing voor piekvoorziening;\nRuimte op het elektriciteitsnet;\nRuimte ondergrond voor warmtenet;\nEventuele restricties omgeving;","Ontwikkelaar systeem;\nInwoners;\nBeleidsafdeling Ondergrond;","Vanaf energielabel D zijn aanvullende isolatiemaatregelen nodig. Gemeente kan dit stimuleren via collectieve inkoopacties en subsidies. LET OP: hoe hoger het energielabel/isolatie, hoe lager de elektriciteitskosten en hoe grotere energiebesparing","Kiezen voor deze warmteoplossing betekent een voorkeur uitspreken voor een collectief systeem met midden temperatuur. Dit zorgt voor een toegankelijkere warmteoplossing, omdat het om minder geïsoleerde gebouwen vraagt.\nSysteem vraagt veel elektriciteit voor opwaardering. Hiervoor dient voldoende Ruimte te zijn op het elektriciteitsnet;\nDeze oplossing biedt mogelijkheid om in een keer meerdere gebouwen aardgasvrij te maken. Kosten kunnen collectief verdeeld worden om inclusiviteit te bevorderen.\nHet systeem biedt geen mogelijkheid tot koeling"]
["Warmtenet","Collectieve warmtepomp - Hybride","Warmtenet - Collectieve warmtepomp - Hybride",{"$f":"VLOOKUP(Tabel3[[#This Row],[Warmtebron & type net]],'A. Breakdown'!$D$3:$G$64,4,FALSE)","v":"Een MT-warmtenet op basis van een collectieve hybride warmtepomp"},"Het systeem is een hybride oplossing waarbij een centrale lucht-water warmtepomp de basis vormt voor het warmtenet. Voor piekbelasting wordt aanvullend een gasgestookte ketel ingezet. Dit modulaire systeem levert warmte op middeltemperatuur (45–75°C) aan gebouwen via convectoren.","Beschikbaarheid gas voor piekbelasting;\nVoldoende isolatie;\nRuimte ondergrond voor warmtenet","Minder geschikt voor nieuwbouw door hoge isolatiegraad gebouwen;\nKansrijk Bij bestaande bouw indien mogelijkheden voor isolatie","Kansrijk bij midden (200 tot 500 weq) kernen;  Kansrijk bij rijgebouwen en appartementen; slecht te isoleren gebouwen","Warmtenet moet ontwikkeld worden, waarin de Gemeente een mogelijke rol kan spelen - dit betekent nadenken over investering en financiering;\nhaalbaarheid en potentie moet onderzocht worden;\ntechniek is innovatief en in pilotfase, dit zorgt voor langere ontwikkeltijd. Gemeente moet nadenken over tijdspad en planning;\nGemeente moet afstemmen met ontwikkelaar systeem;\nGemeente moet warmtebedrijf aanwijzen of vrijstelling verlenen\nOm volledig duurzaam te zijn moet het systeem draaien op groen gas, hier heeft de Gemeente geen sturing op","Warmtebedrijf/exploitant (kan Gemeente zijn):\n-\tInfrastructuur net/leidingen\n-\tOntwikkeling bron\n-\tCentrale warmtepompen en regeltechniek\n-\tOnderhoudskosten\nEindgebruiker (eventueel via Woningcorporatie/verhuurder):\n-\tAansluitkosten\n- vaste lasten aansluiting en onderhoud gasnet\n- gebruik gas\n-\t(eventuele) Isolatiekosten om aangesloten te kunnen worden\n-Gebruikskosten/warmteafname\n-\tVaste maandelijkse lasten voor onderhoud\nLet op: Uiteindelijke kostenverdeling hangt af van keuzes en governance binnen het project en kunnen in wisselende mate bij de gebruiker of het warmtebedrijf liggen","Beschikbaarheid groen gas (op termijn) of alternatieve duurzame bron;\nRuimte ondergrond voor warmtenet;\nEventuele restricties","Ontwikkelaar systeem;\nInwoners;\nBeleidsafdeling Ondergrond;","Vanaf energielabel D zijn aanvullende isolatiemaatregelen nodig. Gemeente kan dit stimuleren via collectieve inkoopacties en subsidies. LET OP: hoe hoger het energielabel/isolatie, hoe lager de elektriciteitskosten en hoe grotere energiebesparing","Kiezen voor deze warmteoplossing betekent een voorkeur uitspreken voor een collectief systeem met midden temperatuur. Dit zorgt voor een toegankelijkere warmteoplossing, omdat het om minder geïsoleerde gebouwen vraagt.\nHet systeem gebruikt gas voor piekmomenten, dit vraagt om goede afwegingen voor gebruik in de toekomst. Er moet onderzocht worden hoe deze piekbelasting duurzaam opgevangen kan worden;\nHet systeem biedt geen mogelijkheid tot koeling\nSysteem vraagt veel elektriciteit voor opwaardering. Hiervoor dient voldoende Ruimte te zijn op het elektriciteitsnet;\nDeze oplossing biedt mogelijkheid om in een keer meerdere gebouwen aardgasvrij te maken. Kosten kunnen collectief verdeeld worden om inclusiviteit te bevorderen."]
["Warmtenet","CV klimaatneutraal gas","Warmtenet - CV klimaatneutraal gas",{"$f":"VLOOKUP(Tabel3[[#This Row],[Warmtebron & type net]],'A. Breakdown'!$D$3:$G$64,4,FALSE)","v":"Een HT-warmtenet op basis van klimaatneutraal gas"},"Verwarming via een CV ketel op klimaatneutraal gas dat aangeleverd wordt via een warmtenet (blok-verwarming). Dit systeem werkt op HT-niveau (> 75°C), maakt gebruik van een hoge temperatuur radiatoren of bestaande afgiftesystemen.","beschikbaarheid van klimaatneutraal gas; Ruimte ondergrond voor systeem; afspraken over organisatie","minder geschikt voor nieuwbouw doordat huizen goed geisoleerd zijn; Kansrijk voor bestaande bouw","Toepasbaar op alle soorten gebouwen; Kansrijk voor groter dorpen en stedelijke kernen (500 tot 1500 weq); geschikt voor gestapelde bouw; geschikt voor rijgebouwen geen piekvoorziening nodig; Kansrijk voor kernen met een middelhoge bebouwingsdichtheid","Warmtenet moet ontwikkeld worden, waarin de Gemeente een mogelijke rol kan spelen - dit betekent nadenken over investering en financiering; \nhaalbaarheid en potentie moet onderzocht worden;  \naanwijzen warmtebedrijf;\nBeschikbaarheid van klimaatneutraal gas is zeer onzeker voor de toekomst en Gemeente kan hier niet op sturen (beperkte regierol) warmtenet vraagt organisatie","Warmtebedrijf/exploitant (kan Gemeente zijn):\n-\tInfrastructuur net/leidingen\n-\tOntwikkeling bron\n-\tCentrale warmtepompen en regeltechniek\n-\tOnderhoudskosten\nEindgebruiker (eventueel via Woningcorporatie/verhuurder):\n-\tAansluitkosten\n-\t(eventuele) Isolatiekosten om aangesloten te kunnen worden\n-Gebruikskosten/warmteafname\n-\tVaste maandelijkse lasten voor onderhoud\nLet op: Uiteindelijke kostenverdeling hangt af van keuzes en governance binnen het project en kunnen in wisselende mate bij de gebruiker of het warmtebedrijf liggen","beschikbaarheid klimaatneutraal gas; prijsontwikkeling","Gasleveranciers;\nRijksoverheid;\nOmgeving en stakeholders","Geen beperkingen. LET OP: hoe hoger het energielabel/isolatie, hoe lager de elektriciteitskosten en hoe grotere energiebesparing","kiezen voor deze oplossingsrichting is niet realistisch op dit moment: de beschikbaarheid van klimaatneutraalgas is erg onzeker, waardoor het weinig handelingsperspectief geeft aan inwoners\nEr is voor deze oplossing geen piekvoorziening nodig;\noplossingrichting biedt geen oplossing voor koeling"]
["Warmtenet","Datathermie LT","Warmtenet - Datathermie LT",{"$f":"VLOOKUP(Tabel3[[#This Row],[Warmtebron & type net]],'A. Breakdown'!$D$3:$G$64,4,FALSE)","v":"Een LT-warmtenet op basis van datathermie"},"Restwarmte uit datacenters wordt centraal benut en via het warmtenet verspreid. Dit systeem werkt op LT-niveau (25-75°C), maakt gebruik van een centrale warmtepomp en levert warmte via vloerverwarming, lage temperatuur radiatoren of convectoren.","aanwezigheid bron;\npiekvoorziening;\nNetcapaciteit voor opwaardering;\nVoldoende isolatie gebouwen\nRuimte ondergrond","Kansrijk bij nieuwbouw in stedelijke gebieden; Bij bestaande bouw afhankelijk van ligging en netcapaciteit.","\ngeen beperkingen op het gebied van waterwinning of natura2000;\nBron is jaarronddragend\nKansrijk bij  dorpen en stedelijke kernen (200 tot 500weq),\n Kansrijk bij flats, appartementen en rijtjesgebouwen.","Warmtenet moet ontwikkeld worden, waarin de Gemeente een mogelijke rol kan spelen - dit betekent nadenken over investering en financiering; \nhaalbaarheid en potentie moet onderzocht worden;  \naanwijzen warmtebedrijf","Warmtebedrijf/exploitant (kan Gemeente zijn):\n-\tInfrastructuur net/leidingen\n-\tOntwikkeling bron\n-\tCentrale warmtepompen en regeltechniek\n-\tOnderhoudskosten\nEindgebruiker (eventueel via Woningcorporatie/verhuurder):\n-\tAansluitkosten\n-\t(eventuele) Isolatiekosten om aangesloten te kunnen worden\n-Gebruikskosten/warmteafname\n-\tVaste maandelijkse lasten voor onderhoud\nLet op: Uiteindelijke kostenverdeling hangt af van keuzes en governance binnen het project en kunnen in wisselende mate bij de gebruiker of het warmtebedrijf liggen","Oplossing voor piekvoorziening;\nSamenwerking met eigenaar datacentra;\nRuimte ondergrond;\npotentie;\nafzetgebied","datacentra; buurGemeenten (eventueel) voor schaalvoordelen;","Vanaf energielabel C zijn aanvullende isolatiemaatregelen nodig. Gemeente kan dit stimuleren via collectieve inkoopacties en subsidies. LET OP: hoe hoger het energielabel/isolatie, hoe lager de elektriciteitskosten en hoe grotere energiebesparing","Kiezen voor deze warmteoplossing betekent een voorkeur uitspreken voor een jaarronddragende collectieve oplossing die geschikt is voor grotere afzetgebieden. Hierdoor kunnen grotere gebieden in een keer aardgasvrij gemaakt worden.\nDe bron inzetten voor een LT-systeem betekent dat goede isolatie van gebouwen nodig is. Deze kosten liggen doorgaans bij de individuele afnemer. De Gemeente kan afwegen hoe zij hier mee om gaat.\nDe Gemeente moet samenwerken met de datacentra en sturen op Ruimtelijke inpassing en organisatie.\nDeze oplossing biedt geen mogelijkheid tot koeling, hiervoor moet gekeken worden naar oplossingen. Gemeente moeten daarnaast rekening houden met de vergankelijkheid van de bron en eventuele alternatieven laten ontwikkelen.\nIndirect vragen datacentra veel energie, dit heeft consequenties voor het algemene energiesysteem"]
["Warmtenet","Datathermie MT",{"$f":"A34&\" - \"&B34","v":"Warmtenet - Datathermie MT"},{"$f":"VLOOKUP(Tabel3[[#This Row],[Warmtebron & type net]],'A. Breakdown'!$D$3:$G$64,4,FALSE)","v":"Een MT-warmtenet op basis van datathermie"},"Restwarmte uit datacenters wordt centraal benut en via het warmtenet verspreid. Dit systeem werkt op MT-niveau (50-75°C), maakt gebruik van een centrale warmtepomp en levert warmte via vloerverwarming, lage temperatuur radiatoren of convectoren.","aanwezigheid bron;\npiekvoorziening;\nNetcapaciteit voor opwaardering;\nRuimte voor net in ondergrond","Minder geschikt voor nieuwbouw door goede initiele isolatie; Bij bestaande bouw afhankelijk van ligging en netcapaciteit.","\ngeen beperkingen op het gebied van waterwinning of natura2000;\nBron is jaarronddragend\nKansrijk bij  dorpen en stedelijke kernen (200 tot 500weq),\n Kansrijk bij flats, appartementen en rijtjesgebouwen.\nKansrijker bij slechter te isoleren gebouwen","Warmtenet moet ontwikkeld worden, waarin de Gemeente een mogelijke rol kan spelen - dit betekent nadenken over investering en financiering; \nhaalbaarheid en potentie moet onderzocht worden;  \naanwijzen warmtebedrijf","Warmtebedrijf/exploitant (kan Gemeente zijn):\n-\tInfrastructuur net/leidingen\n-\tOntwikkeling bron\n-\tCentrale warmtepompen en regeltechniek\n-\tOnderhoudskosten\nEindgebruiker (eventueel via Woningcorporatie/verhuurder):\n-\tAansluitkosten\n-\t(eventuele) Isolatiekosten om aangesloten te kunnen worden\n-Gebruikskosten/warmteafname\n-\tVaste maandelijkse lasten voor onderhoud\nLet op: Uiteindelijke kostenverdeling hangt af van keuzes en governance binnen het project en kunnen in wisselende mate bij de gebruiker of het warmtebedrijf liggen","Oplossing voor piekvoorziening;\nSamenwerking met eigenaar datacentra;\nRuimte ondergrond;\npotentie;\nafzetgebied","datacentra;\nbuurGemeenten (eventueel) voor schaalvoordelen;\nNetbeheerder","Vanaf energielabel D zijn aanvullende isolatiemaatregelen nodig. Gemeente kan dit stimuleren via collectieve inkoopacties en subsidies. LET OP: hoe hoger het energielabel/isolatie, hoe lager de elektriciteitskosten en hoe grotere energiebesparing","Kiezen voor deze warmteoplossing betekent een voorkeur uitspreken voor een jaarronddragende MT collectieve oplossing die geschikt is voor grotere afzetgebieden. Hierdoor kunnen grotere gebieden in een keer aardgasvrij gemaakt worden.\nDoor te kiezen voor een MT-systeem, vraag de bron om centrale opwaardering. Dit kan niet wanneer er onvoldoende Ruimte op het elektriciteitsnet is.\nDe Gemeente moet samenwerken met de datacentra en sturen op Ruimtelijke inpassing en organisatie.\nDeze oplossing biedt geen mogelijkheid tot koeling, hiervoor moet gekeken worden naar oplossingen. Gemeente moeten daarnaast rekening houden met de vergankelijkheid van de bron en eventuele alternatieven laten ontwikkelen.\nIndirect vragen datacentra veel energie, dit heeft consequenties voor het algemene energiesysteem"]
["Warmtenet","Diepe geothermie​","Warmtenet - Diepe geothermie​",{"$f":"VLOOKUP(Tabel3[[#This Row],[Warmtebron & type net]],'A. Breakdown'!$D$3:$G$64,4,FALSE)","v":"Een HT-warmtenet op basis van diepe geothermie"},"Hoge temperatuur warmte uit diepe geothermie wordt centraal opgewekt en via een warmtenet geleverd. Dit systeem werkt op HT-niveau (> 75°C), maakt gebruik van een centrale warmtepomp en levert warmte via hoge temperatuur radiatoren of bestaande afgiftesystemen.","Aanwezigheid bron; \nVoldoende afzet;\n Ruimte in de openbare Ruimte; \nGeen waterwinningsgebied","Toepasbaar in grotere kernen met slecht te isoleren bestaande bouw; bij nieuwbouw ook inzetbaar.","Kansrijk bij grote dorpen en stedelijke kernen (1500 tot 1500 weq); \nKansrijk bij samenwerkingen tussen kernen;\nKansrijk bij rijgebouwen en appartementen; \nKansrijk bij slecht te isoleren gebouwen","Systeem vraagt visie en langetermijnsdenken, aangezien ontwikkeltijd van bron lang is; \nBroneigenaarschap en verdeling kan provinciaal of bovengemeentelijk gecoördineerd worden, afstemming nodig\nsysteem vraagt goede afstemming met verschillende stakeholders; \nGemeente moet warmtebedrijf aanwijzen voor levering, kan hier zelf aan deelnemen;","Warmtebedrijf/exploitant (kan Gemeente zijn):\n-\tInfrastructuur net/leidingen\n-\tOntwikkeling bron\n-\tCentrale warmtepompen en regeltechniek\n-\tOnderhoudskosten\nEindgebruiker (eventueel via Woningcorporatie/verhuurder):\n-\tAansluitkosten\n-\t(eventuele) Isolatiekosten om aangesloten te kunnen worden\n-Gebruikskosten/warmteafname\n-\tVaste maandelijkse lasten voor onderhoud\nLet op: Uiteindelijke kostenverdeling hangt af van keuzes en governance binnen het project en kunnen in wisselende mate bij de gebruiker of het warmtebedrijf liggen","Waterwinning beperkt de mogelijkheid, onderzoek hiernaar is nodig voor oplossingsrichting; \nRuimte in ondergrond;\noplossing voor piekvoorziening;\nVoldoende warmtevraag;\nWarmtebedrijf voor levering","EBN; \nprovincie; \nbuurGemeente voor schaalvergroting","Geen beperkingen. LET OP: hoe hoger het energielabel/isolatie, hoe lager de elektriciteitskosten en hoe grotere energiebesparing","Kiezen voor deze warmteoplossing betekent een voorkeur uitspreken voor een oplossingsrichting die vanaf 1500 aansluiting idealiter (technisch) kan worden toegepast. Dit kan hierdoor in de vorm van een grootschalig collectief systeem, via een publieke partij of een publiek-private samenwerking (met 50% meerderheidsaandel publiek). ; Kiezen voor deze oplossingsrichting is kiezen voor een langetermijnsoplossingsrichting. \nDe ontwikkelfase duurt lang en is door de vele stakeholders complex. Het leidt echter wel tot een toekomstbestendige warmteoplossing welke langdurig toepasbaar blijft. Daarnaast biedt het warmtenet de mogelijkheid om het tempo van de warmtetransitie gerichter te sturen en gebouwen gelijktijdig aardgasvrij te maken. \nOplossingsrichting biedt geen oplossing voor koelte, waardoor hier een andere oplossing voor gevonden dient te worden. Bij deze oplossingsrichting is een piekvoorziening nodig bij hoge warmtevraag (bijvoorbeeld koude dagen) "]
["Warmtenet","Geothermie + HTO","Warmtenet - Geothermie + HTO",{"$f":"VLOOKUP(Tabel3[[#This Row],[Warmtebron & type net]],'A. Breakdown'!$D$3:$G$64,4,FALSE)","v":"Een HT-warmtenet op basis van geothermie, inclusief HTO (hoge temperatuursopslag)"},"Geothermie wordt gecombineerd met hoge temperatuur opslag en via het warmtenet geleverd. Dit systeem werkt op HT-niveau (> 75°C), maakt gebruik van een centrale warmtepomp en levert warmte via hoge temperatuur radiatoren of bestaande afgiftesystemen.","Aanwezigheid bron; \nRuimte HT-opslag; \nRuimte ondergrond;\nGeen waterwinningsgebied","Toepasbaar in grotere kernen met slecht te isoleren bestaande bouw; bij nieuwbouw ook inzetbaar.","Kansrijk bij grote dorpen en stedelijke kernen (1500 tot 1500 weq); \nKansrijk bij samenwerkingen tussen kernen;\nKansrijk bij rijgebouwen en appartementen; \nKansrijk bij slecht te isoleren gebouwen","Systeem vraagt visie en langetermijnsdenken, aangezien ontwikkeltijd van bron lang is; \nBroneigenaarschap en verdeling kan provinciaal of bovengemeentelijk gecoördineerd worden, afstemming nodig\nsysteem vraagt goede afstemming met verschillende stakeholders; \nGemeente moet warmtebedrijf aanwijzen voor levering, kan hier zelf aan deelnemen;","Warmtebedrijf/exploitant (kan Gemeente zijn):\n-\tInfrastructuur net/leidingen\n-\tOntwikkeling bron\n-\tCentrale warmtepompen en regeltechniek\n-\tOnderhoudskosten\nEindgebruiker (eventueel via Woningcorporatie/verhuurder):\n-\tAansluitkosten\n-\t(eventuele) Isolatiekosten om aangesloten te kunnen worden\n-Gebruikskosten/warmteafname\n-\tVaste maandelijkse lasten voor onderhoud\nLet op: Uiteindelijke kostenverdeling hangt af van keuzes en governance binnen het project en kunnen in wisselende mate bij de gebruiker of het warmtebedrijf liggen","Waterwinning en Natura2000 beperkt de mogelijkheid, onderzoek hiernaar is nodig voor oplossingsrichting; \nRuimte in ondergrond voor warmtenet en HTO;\nVoldoende warmtevraag;\nWarmtebedrijf voor levering","EBN; \nprovincie; \nbuurGemeente voor schaalvergroting","Geen beperkingen. LET OP: hoe hoger het energielabel/isolatie, hoe lager de elektriciteitskosten en hoe grotere energiebesparing","Kiezen voor deze warmteoplossing betekent een voorkeur uitspreken voor een toekomstbestendige collectieve oplossing met opslagmogelijkheid. De oplossing maakt levering op piekmomenten mogelijk, maar vereist lange ontwikkeltijd en samenwerking op regionaal niveau. Schaalvoordelen kunnen zitten in het vergroten van afzet en de verdeling van kosten, maar vragen denkwerk rondom de organisatie van de warmteontwikkeling en -levering. Kiezen voor dit systeem betekent de mogelijkheid om in een keer veel gebouwen aardgasvrij te krijgen.\n Kiezen voor dit systeem betekent kiezen voor een robuuste oplossingsrichting. Er is voor deze oplossing geen piekvoorziening nodig"]
["Warmtenet","Gesloten bodemenergie​ LT","Warmtenet - Gesloten bodemenergie​ LT",{"$f":"VLOOKUP(Tabel3[[#This Row],[Warmtebron & type net]],'A. Breakdown'!$D$3:$G$64,4,FALSE)","v":"Een LT-warmtenet op basis van een gesloten bodemenergie systeem"},"Gesloten bodemlussen leveren warmte aan een centrale warmtepomp, die via een warmtenet verspreidt. Dit systeem werkt op LT-niveau (25-75°C), maakt gebruik van een centrale warmtepomp en levert warmte via vloerverwarming, lage temperatuur radiatoren of convectoren.","Ruimte in de ondergrond;\ngeen juridische restricties;\nVoldoende isolatie;\noplossing voor buffering/opslag","Kansrijk bij nieuwbouw; Bij bestaande bouw alleen bij Voldoende Ruimte in ondergrond. Kan uitdagend zijn bij monumentale panden.","Kansrijk bij kleine kernen (2 tot 200 weq);\nKansrijk bij woonwijken met rijgebouwen of gestapelde bouw; \nKansrijk bij nieuwbouw","Warmtenet moet gerealiseerd worden\nGemeenten moeten rekening houden met de instructieregels van het Besluit kwaliteit leefomgeving en de omgevingsverordening.\nHet is belangrijk om te zorgen dat het systeem geen interferentie veroorzaakt met andere ondergrondenergiesystemen;\naanwijzen warmtebedrijf;","Warmtebedrijf/exploitant (kan Gemeente zijn):\n-\tInfrastructuur net/leidingen\n-\tOntwikkeling bron\n-\tCentrale warmtepompen en regeltechniek\n-\tOnderhoudskosten\nEindgebruiker (eventueel via Woningcorporatie/verhuurder):\n-\tAansluitkosten\n-\t(eventuele) Isolatiekosten om aangesloten te kunnen worden\n-Gebruikskosten/warmteafname\n-\tVaste maandelijkse lasten voor onderhoud\nLet op: Uiteindelijke kostenverdeling hangt af van keuzes en governance binnen het project en kunnen in wisselende mate bij de gebruiker of het warmtebedrijf liggen","restricties waterwinningsgebied (indien van toepassing);\nrestricties ondergrond;\naanpassingen gebouwen;\nOplossing voor piekvoorziening;","Beleidsafdeling ondergrond;\nomgevingsdienst;\nbewonersinitiatieven","Energielabel c of lager vereist aanvullende isolatiemaatregelen. Gemeente kan dit stimuleren via subsidies, collectieve inkoopacties en advies. LET OP: hoe hoger het energielabel/isolatie, hoe lager de elektriciteitskosten en hoe grotere energiebesparing","Kiezen voor deze warmteoplossing betekent een voorkeur uitspreken voor een LT-collectief systeem dat minder afhankelijk is van grondwater, maar wel Ruimte in de ondergrond vereist.\nDe Gemeente moet sturen op Ruimtelijke inpassing en voorkomen van interferentie.\nDe oplossing is Kansrijk bij nieuwbouw en geïsoleerde gebouwen\nHierdoor kan het mogelijk breder worden ingezet.\nHet systeem kan mogelijk een groter aantal huizen in een keer aardgasvrij maken"]
["Warmtenet","Gesloten bodemenergie​ MT","Warmtenet - Gesloten bodemenergie​ MT",{"$f":"VLOOKUP(Tabel3[[#This Row],[Warmtebron & type net]],'A. Breakdown'!$D$3:$G$64,4,FALSE)","v":"Een MT-warmtenet op basis van een gesloten bodemenergie systeem / bodemlus (WKO)"},"Gesloten bodemlussen leveren warmte aan een centrale warmtepomp, die via een warmtenet verspreidt. Dit systeem werkt op MT-niveau (50-75°C), maakt gebruik van een centrale warmtepomp en levert warmte via vloerverwarming, lage temperatuur radiatoren of convectoren.","Ruimte in de ondergrond;\nVoldoende Ruimte op elektriciteitsnet;\noplossing voor buffering/opslag","Minder geschikt voor nieuwbouw in verband met goede isolatie van gebouwen; Bij bestaande bouw potentieel Kansrijk, afhankelijk van Ruimte ondergrond (zie randvoorwaarden)","Kansrijk bij kleine kernen (2 tot 200 weq);\nKansrijk bij woonwijken met rijgebouwen of gestapelde bouw; \nKansrijk bij minder goed te isoleren gebouwen;","Warmtenet moet gerealiseerd worden\nGemeenten moeten rekening houden met de instructieregels van het Besluit kwaliteit leefomgeving en de omgevingsverordening.\nHet is belangrijk om te zorgen dat het systeem geen interferentie veroorzaakt met andere ondergrondenergiesystemen;\naanwijzen warmtebedrijf;","Warmtebedrijf/exploitant (kan Gemeente zijn):\n-\tInfrastructuur net/leidingen\n-\tOntwikkeling bron\n-\tCentrale warmtepompen en regeltechniek\n-\tOnderhoudskosten\nEindgebruiker (eventueel via Woningcorporatie/verhuurder):\n-\tAansluitkosten\n-\t(eventuele) Isolatiekosten om aangesloten te kunnen worden\n-Gebruikskosten/warmteafname\n-\tVaste maandelijkse lasten voor onderhoud\nLet op: Uiteindelijke kostenverdeling hangt af van keuzes en governance binnen het project en kunnen in wisselende mate bij de gebruiker of het warmtebedrijf liggen","restricties waterwinningsgebied (indien van toepassing);\nrestricties ondergrond;\nRuimte elektriciteitsnet\naanpassingen gebouwen;\nOplossing voor piekvoorziening;","Beleidsafdeling ondergrond;\nomgevingsdienst;\nbewonersinitiatieven","Energielabel D of lager vereist aanvullende isolatiemaatregelen. Gemeente kan dit stimuleren via subsidies, collectieve inkoopacties en advies. LET OP: hoe hoger het energielabel/isolatie, hoe lager de elektriciteitskosten en hoe grotere energiebesparing","Kiezen voor deze warmteoplossing betekent een voorkeur uitspreken voor een MT-collectief systeem dat minder afhankelijk is van grondwater, maar wel Ruimte in de ondergrond vereist.\nHet systeem kan mogelijk een groter aantal huizen in een keer aardgasvrij maken\nDe Gemeente moet sturen op Ruimtelijke inpassing en voorkomen van interferentie.\nDe oplossing is Kansrijk bij nieuwbouw en geïsoleerde gebouwen\nOpwaarderen tot MT-bron vraag voldoende elektriciteit, het is aan te raden na te gaan of dit mogelijk is."]
["Warmtenet","Industriele restwarmte","Warmtenet - Industriele restwarmte",{"$f":"VLOOKUP(Tabel3[[#This Row],[Warmtebron & type net]],'A. Breakdown'!$D$3:$G$64,4,FALSE)","v":"Een HT-warmtenet op basis van industriële restwarmte"},"Restwarmte uit industrie wordt via een warmtenet geleverd. Dit systeem werkt op HT-niveau (> 75°C), maakt gebruik van een centrale warmtepomp en levert warmte via hoge temperatuur radiatoren of bestaande afgiftesystemen.","aanwezigheid bron; Voldoende afzet;","minder geschikt voor nieuwbouw doordat huizen goed geisoleerd zijn; Kansrijk voor bestaande bouw","Kansrijk bij grote dorpen en stedelijke kernen (1500 tot 1500 weq weq);\n Kansrijk bij rijgebouwen en appartementen; slecht te isoleren gebouwen","Warmtenet moet ontwikkeld worden, waarin de Gemeente een mogelijke rol kan spelen - dit betekent nadenken over investering en financiering; \nhaalbaarheid en potentie moet onderzocht worden;  \naanwijzen warmtebedrijf","Warmtebedrijf/exploitant (kan Gemeente zijn):\n-\tInfrastructuur net/leidingen\n-\tOntwikkeling bron\n-\tCentrale warmtepompen en regeltechniek\n-\tOnderhoudskosten\nEindgebruiker (eventueel via Woningcorporatie/verhuurder):\n-\tAansluitkosten\n-\t(eventuele) Isolatiekosten om aangesloten te kunnen worden\n-Gebruikskosten/warmteafname\n-\tVaste maandelijkse lasten voor onderhoud\nLet op: Uiteindelijke kostenverdeling hangt af van keuzes en governance binnen het project en kunnen in wisselende mate bij de gebruiker of het warmtebedrijf liggen","Levensduur van bron/industrie;\nRuimte in ondergrond voor warmtenet;\nVoldoende afzet\noplossing voor piekvoorziening;\nVoldoende warmtevraag;\nWarmtebedrijf voor levering","Industrie; beleidsafdelingen ondergrond;","Geen beperkingen. LET OP: hoe hoger het energielabel/isolatie, hoe lager de elektriciteitskosten en hoe grotere energiebesparing","Kiezen voor deze warmteoplossing betekent een voorkeur uitspreken voor een jaarronddragende collectieve oplossing die geschikt is voor grotere afzetgebieden. Hierdoor kunnen grotere gebieden in een keer aardgasvrij gemaakt worden. De Gemeente moet samenwerken met de industrie en sturen op Ruimtelijke inpassing en organisatie. Deze oplossing biedt geen mogelijkheid tot koeling. Gemeente moeten daarnaast rekening houden met de vergankelijkheid van de bron en eventuele alternatieven laten ontwikkelen. Bij deze oplossingsrichting is een piekvoorziening nodig bij hoge warmtevraag (bijvoorbeeld koude dagen) - kiezen voor deze oplossing betekent dat hierover nagedacht moet worden (back up ketel bijvoorbeeld)"]
["Warmtenet","Industriële restwarmte + HTO","Warmtenet - Industriële restwarmte + HTO",{"$f":"VLOOKUP(Tabel3[[#This Row],[Warmtebron & type net]],'A. Breakdown'!$D$3:$G$64,4,FALSE)","v":"Een HT-warmtenet op basis van industriële restwarmte, inclusief HTO (hoge temperatuursopslag)"},"Restwarmte uit industrie wordt opgeslagen in HTO en via het warmtenet geleverd. Dit systeem werkt op HT-niveau (> 75°C), maakt gebruik van een centrale warmtepomp en levert warmte via hoge temperatuur radiatoren of bestaande afgiftesystemen.","aanwezigheid bron; \nRuimte HT-opslag; \nRuimte ondergrond;\nAlternatieve bron indien industrie vergankelijk is. ","minder geschikt voor nieuwbouw doordat huizen goed geisoleerd zijn; Kansrijk voor bestaande bouw","Kansrijk bij grote dorpen en stedelijke kernen (1500 tot 1500 weq weq); \nKansrijk bij samenwerkingen tussen kernen;\nKansrijk bij rijgebouwen en appartementen; \nKansrijk bij slecht te isoleren gebouwen","Restwarmte uit industriële processen is een oplossingsrichting die vaker is toegepast. Een Gemeente kan hierdoor de best practices meenemen indien er gekozen wordt voor deze oplossing. \nGemeenten met kleine kernen kunnen onderzoeken of er door bovenGemeentelijke benutting van de bron, schaalvoordelen gerealiseerd kunnen worden.\nGemeente moet warmtebedrijf aanwijzen voor levering, kan hier zelf aan deelnemen;","Warmtebedrijf/exploitant (kan Gemeente zijn):\n-\tInfrastructuur net/leidingen\n-\tOntwikkeling bron\n-\tCentrale warmtepompen en regeltechniek\n-\tOnderhoudskosten\nEindgebruiker (eventueel via Woningcorporatie/verhuurder):\n-\tAansluitkosten\n-\t(eventuele) Isolatiekosten om aangesloten te kunnen worden\n-Gebruikskosten/warmteafname\n-\tVaste maandelijkse lasten voor onderhoud\nLet op: Uiteindelijke kostenverdeling hangt af van keuzes en governance binnen het project en kunnen in wisselende mate bij de gebruiker of het warmtebedrijf liggen","Levensduur van bron/industrie;\nRuimte in ondergrond voor warmtenet;\nVoldoende afzet\nRuimte voor HTO;\nVoldoende warmtevraag;\nWarmtebedrijf voor levering","Industrie;\n beleidsafdelingen ondergrond voor leidingen en warmtenet;\nEventuele andere kernen/gemeenten","Geen beperkingen. LET OP: hoe hoger het energielabel/isolatie, hoe lager de elektriciteitskosten en hoe grotere energiebesparing","Kiezen voor deze warmteoplossing betekent een voorkeur uitspreken voor een jaarronddragende collectieve oplossing die geschikt is voor grotere afzetgebieden. Hierdoor kunnen grotere gebieden in een keer aardgasvrij gemaakt worden. De Gemeente moet samenwerken met de industrie en sturen op Ruimtelijke inpassing en organisatie. Deze oplossing biedt geen mogelijkheid tot koeling. Gemeente moeten daarnaast rekening houden met de vergankelijkheid van de bron en eventuele alternatieven laten ontwikkelen."]
["Warmtenet","Ondiepe geothermie​","Warmtenet - Ondiepe geothermie​",{"$f":"VLOOKUP(Tabel3[[#This Row],[Warmtebron & type net]],'A. Breakdown'!$D$3:$G$64,4,FALSE)","v":"Een LT-warmtenet op basis van ondiepe geothermie"},"Ondiepe geothermie op basis van een warmtenet is een systeem waar warmte vanuit de ondergrond (tot 1500 m) wordt ingezet voor de verwarming van huizen. Via een collectief systeem wordt de warmte naar gebouwen vervoerd en centraal opgewaardeerd. ","aanwezigheid bron; Voldoende afzet; Ruimte in de openbare Ruimte;","Kansrijk bij nieuwbouw vanwege directe aansluiting; Bij bestaande bouw vereist goede isolatie.","Kansrijk in  grote kernen of samenwerking met andere kernen (1500 tot 1500 weq weq);\nJaarronddragende bron, toekomstbestendig;\nKansrijk bij dichtbevolkte kernen","Oplossingsrichting heeft lange ontwikkeltijd, dus vraagt om tijdspad en perspectief richting inwoners;\nIndien schaalvoordelen nodig zijn, kan samenwerking worden gezocht met buurkernen en -Gemeenten;\nGemeente moet onderzoek doen naar implicaties indien bron zich bevindt in waterwinningsgebied; Gemeente moet onderzoek doen naar implicaties indien bron zich bevindt in Natura2000-gebied;\nOplossing werkt op collectief systeem, dus de Gemeente moet nadenken over rolneming, financiering en eventueel aanwijzen of zelf deelnemen in warmtebedrijf","Warmtebedrijf/exploitant (kan Gemeente zijn):\n-\tInfrastructuur net/leidingen\n-\tOntwikkeling bron\n-\tCentrale warmtepompen en regeltechniek\n-\tOnderhoudskosten\nEindgebruiker (eventueel via Woningcorporatie/verhuurder):\n-\tAansluitkosten\n-\t(eventuele) Isolatiekosten om aangesloten te kunnen worden\n-Gebruikskosten/warmteafname\n-\tVaste maandelijkse lasten voor onderhoud\nLet op: Uiteindelijke kostenverdeling hangt af van keuzes en governance binnen het project en kunnen in wisselende mate bij de gebruiker of het warmtebedrijf liggen","Kiezen voor deze oplossing betekent onderzoeken welke piekvoorziening aanvullend toegepast kan worden","Nationale overheid; EBN; Geothermie Nederland; buurGemeenten; omgevingsdienst; De impact op het elektriciteitsnet/invloed op netcongestie is gemiddeld, waardoor afstemming met netbeheerder aan te raden is.","Direct toepasbaar bij energielabel A en B, daaronder is een kleine investering nodig bij C en daaronder (vanaf D) flinke investering nodig om de bron betaalbaar toe te passen. LET OP: hoe hoger het energielabel/isolatie, hoe lager de elektriciteitskosten en hoe grotere energiebesparing.","Kiezen voor deze warmteoplossing betekent een voorkeur uitspreken voor een grootschalige collectieve oplossing met een lange ontwikkeltijd.\nDe oplossing is toekomstbestendig en jaarronddragend, maar vereist minimaal 1500 aansluitingen en afstemming met netbeheerder. Gebouwen worden gelijktijdig aardgasvrij gemaakt, waardoor individuele keuzevrijheid beperkt is maar grote delen van de Gemeente in een keer aardgasvrij kunnen en kosten collectief gedeeld en verspreid kunnen worden.\nEr zijn veel stakeholders betrokken bij de ontwikkeling van dit systeem;\nhet systeem biedt geen mogelijkheid tot koeling"]
["Warmtenet","Open bodemenergie​ LT (WKO)","Warmtenet - Open bodemenergie​ LT (WKO)",{"$f":"VLOOKUP(Tabel3[[#This Row],[Warmtebron & type net]],'A. Breakdown'!$D$3:$G$64,4,FALSE)","v":"Een LT-warmtenet op basis van een open bodemenergie systeem (WKO)"},"WKO-systeem levert warmte via een centrale warmtepomp aan een warmtenet. Dit systeem werkt op LT-niveau (25-55°C), maakt gebruik van een centrale warmtepomp en levert warmte via vloerverwarming, lage temperatuur radiatoren of convectoren.","Goede isolatie gebouwen; Ruimte op het elektriciteitsnet;\nmiddelhoge bebouwingsdichtheid nodig, dit houdt in dat er dorpsgebouwen bij elkaar staan, zoals een schil rondom de kern. Hoge bebouwingsdichtheid ook mogelijk (zoals hoogbouw of centrum);\nRuimte in de ondergrond;\nRuimte op het elektriciteitsnet; voldoende isolatie","Kansrijk bij nieuwbouw; Bij bestaande bouw alleen toepasbaar na isolatie en aanpassing.","Geen natuurlijke bron nodig;\nrijtjeshuizen; twee tot onder tot een kap gebouwen;\nnieuwbouw;\nKanrijk bij kleine kernen (2 tot 200 weq)","Gemeenten moeten rekening houden met de instructieregels van het Besluit kwaliteit leefomgeving en de omgevingsverordening. Het is belangrijk om te zorgen dat het systeem geen interferentie veroorzaakt met andere bodemenergiesystemen; aanwijzen warmtebedrijf; haalbaarheid potentie","Warmtebedrijf/exploitant (kan Gemeente zijn):\n-\tInfrastructuur net/leidingen\n-\tOntwikkeling bron\n-\tCentrale warmtepompen en regeltechniek\n-\tOnderhoudskosten\nEindgebruiker (eventueel via Woningcorporatie/verhuurder):\n-\tAansluitkosten\n-\t(eventuele) Isolatiekosten om aangesloten te kunnen worden\n-Gebruikskosten/warmteafname\n-\tVaste maandelijkse lasten voor onderhoud\nLet op: Uiteindelijke kostenverdeling hangt af van keuzes en governance binnen het project en kunnen in wisselende mate bij de gebruiker of het warmtebedrijf liggen","Ruimte in ondergrond voor systeem;\nRuimte in ondergrond voor warmtenet;\nRestricties en beperking waterwinningsgebied;\n","Beleidsafdeling ondergrond;\nomgevingsdienst;\nbewonersinitiatieven","Vanaf energielabel C zijn aanvullende isolatiemaatregelen nodig. Gemeente kan dit stimuleren via collectieve inkoopacties en subsidies. LET OP: hoe hoger het energielabel/isolatie, hoe lager de elektriciteitskosten en hoe grotere energiebesparing","Kiezen voor deze warmteoplossing betekent een voorkeur uitspreken voor een collectief systeem dat vraagt om goede isolatie en afstemming met ondergrondbeleid. De Gemeente moet rekening houden met interferentie tussen systemen en beperkte flexibiliteit voor gebouweigenaren. Deze oplossing biedt wel mogelijkheid tot koeling. Het systeem is toepasbaar op verschillende schaalgrootte, wat effect heeft op de organisatie."]
["Warmtenet","Open bodemenergie​ MT (WKO)","Warmtenet - Open bodemenergie​ MT (WKO)",{"$f":"VLOOKUP(Tabel3[[#This Row],[Warmtebron & type net]],'A. Breakdown'!$D$3:$G$64,4,FALSE)","v":"Een MT-warmtenet op basis van een open bodemenergie systeem (WKO)"},"WKO-systeem levert warmte via een centrale warmtepomp aan een warmtenet. Dit systeem werkt op MT-niveau (50-75°C), maakt gebruik van een centrale warmtepomp en levert warmte via vloerverwarming, lage temperatuur radiatoren of convectoren.","Aanwezigheid bron;\nVoldoende potentie;\nRuimte op het elektriciteitsnet;\nVoldoende afzet;\nRuimte WKO","Minder Kansrijk bij nieuwbouw door goede isolatie en aanlegmogelijkheden - de gebouwen moeten gebouwd worden waardoor niet achteraf ingrepen gedaan hoeven te worden; Bij bestaande bouw alleen toepasbaar na isolatie en technische aanpassingen.","Geen natuurlijke bron nodig;\nrijtjeshuizen; twee tot onder tot een kap gebouwen;\nKanrijk bij kleine kernen (2 tot 200 weq)","Warmtenet moet gerealiseerd worden\nGemeenten moeten rekening houden met de instructieregels van het Besluit kwaliteit leefomgeving en de omgevingsverordening.\nHet is belangrijk om te zorgen dat het systeem geen interferentie veroorzaakt met andere bodemenergiesystemen;\naanwijzen warmtebedrijf;","Warmtebedrijf/exploitant (kan Gemeente zijn):\n-\tInfrastructuur net/leidingen\n-\tOntwikkeling bron\n-\tCentrale warmtepompen en regeltechniek\n-\tOnderhoudskosten\nEindgebruiker (eventueel via Woningcorporatie/verhuurder):\n-\tAansluitkosten\n-\t(eventuele) Isolatiekosten om aangesloten te kunnen worden\n-Gebruikskosten/warmteafname\n-\tVaste maandelijkse lasten voor onderhoud\nLet op: Uiteindelijke kostenverdeling hangt af van keuzes en governance binnen het project en kunnen in wisselende mate bij de gebruiker of het warmtebedrijf liggen","Ruimte in ondergrond voor systeem;\nRuimte in ondergrond voor warmtenet;\nRestricties en beperking waterwinningsgebied;\nRuimte Elektriciteitsnet","Beleidsafdeling ondergrond;\nomgevingsdienst;\nbewonersinitiatieven;\nnetbeheerder","Energielabel D of lager vereist aanvullende isolatiemaatregelen. Gemeente kan dit stimuleren via subsidies, collectieve inkoopacties en advies. LET OP: hoe hoger het energielabel/isolatie, hoe lager de elektriciteitskosten en hoe grotere energiebesparing","Kiezen voor deze warmteoplossing betekent een voorkeur uitspreken voor een MT-collectief systeem dat minder afhankelijk is van grondwater, maar wel Ruimte in de ondergrond vereist.\nHet systeem kan mogelijk een groter aantal huizen in een keer aardgasvrij maken\nDe Gemeente moet sturen op Ruimtelijke inpassing en voorkomen van interferentie.\nDe oplossing is Kansrijk bij nieuwbouw en geïsoleerde gebouwen\nOpwaarderen tot MT-bron vraag voldoende elektriciteit, het is aan te raden na te gaan of dit mogelijk is."]
["Warmtenet","Power-to-heat","Warmtenet - Power-to-heat",{"$f":"VLOOKUP(Tabel3[[#This Row],[Warmtebron & type net]],'A. Breakdown'!$D$3:$G$64,4,FALSE)","v":"Een MT-warmtenet op basis van Power-to-Heat, waarbij elektriciteit wordt omgezet in warmte. "},"Overschot aan duurzame elektriciteit wordt omgezet in warmte (bijv. via boilers) en opgeslagen of direct gebruikt. Toelevering naar gebouwde omgeving gaat via een warmtenet","Aanwezigheid opweksystemen; \nOpslagsysteem","minder geschikt voor nieuwbouw doordat huizen goed geisoleerd zijn; \nKansrijk voor bestaande bouw","Kansrijk bij grote kernen (5000+ weq); \nKansrijk bij woonwijken met rijgebouwen of gestapelde bouw; \nKansrijk bij slechter te isoleren huizen","Warmtenet moet ontwikkeld worden, waarin de Gemeente een mogelijke rol kan spelen - dit betekent nadenken over investering en financiering; \nhaalbaarheid en potentie moet onderzocht worden;  \naanwijzen warmtebedrijf","Warmtebedrijf/exploitant (kan Gemeente zijn):\n-\tInfrastructuur net/leidingen\n-\tOntwikkeling bron\n-\tCentrale warmtepompen en regeltechniek\n-\tOnderhoudskosten\nEindgebruiker (eventueel via Woningcorporatie/verhuurder):\n-\tAansluitkosten\n-\t(eventuele) Isolatiekosten om aangesloten te kunnen worden\n-Gebruikskosten/warmteafname\n-\tVaste maandelijkse lasten voor onderhoud\nLet op: Uiteindelijke kostenverdeling hangt af van keuzes en governance binnen het project en kunnen in wisselende mate bij de gebruiker of het warmtebedrijf liggen","Piekvoorziening nodig;\nRuimte voor eventuele boiler;\nRuimte in ondergrond voor Warmtenet;","Eigenaren duurzame opwek; Gemeentelijke ambtenaren Ruimtelijke ordening; Gemeentelijke ambtenaren energie; RES-regio; aangrenzende Gemeenten","Vanaf energielabel C zijn aanvullende isolatiemaatregelen nodig. Gemeente kan dit stimuleren via collectieve inkoopacties en subsidies. LET OP: hoe hoger het energielabel/isolatie, hoe lager de elektriciteitskosten en hoe grotere energiebesparing","Kiezen voor deze warmteoplossing betekent een voorkeur uitspreken voor een systeem dat afhankelijk is van duurzame elektriciteit en opslag.\nKiezen voor deze oplossing betekent voorkeur uitspreken voor een collectief systeem. Dit kan zorgen dat meerdere gebouwen gelijktijdig aardgasvrij gemaakt kunnen worden. De oplossing levert middentemperatuurwarmte en is geschikt voor ook minder goed geïsoleerde gebouwen.\nVereist nabijheid van opwekinstallaties en afstemming over netcapaciteit.\nDeze oplossing biedt geen mogelijkheid tot koeling."]
["Warmtenet","PVT (WKO)","Warmtenet - PVT (WKO)",{"$f":"VLOOKUP(Tabel3[[#This Row],[Warmtebron & type net]],'A. Breakdown'!$D$3:$G$64,4,FALSE)","v":"Een LT-warmtenet op basis van PVT-zonnepanelen, inclusief WKO"},"PVT-panelen leveren thermische energie aan een WKO-buffer, die via het warmtenet verspreidt. Dit systeem werkt op LT-niveau (25-40°C), maakt gebruik van een centrale warmtepomp en levert warmte via vloerverwarming of lage temperatuur radiatoren.","Ruimte op daken; Ruimte voor WKO; piekvoorziening;","Kansrijk bij nieuwbouw met Ruimte voor panelen; Bij bestaande bouw afhankelijk van dakoppervlak en netcapaciteit.","Kansrijk bij verspreide bebouwing en landelijke dorpen;\nKansrijk bij rijtjesgebouwen en appartementen;\nKansrijk bij lint tot bebouwing;\nKansrijk als kleinschalig gedeeld systeem","Warmtenet moet ontwikkeld worden, waarin de Gemeente een mogelijke rol kan spelen - dit betekent nadenken over investering en financiering; \nhaalbaarheid en potentie moet onderzocht worden;  \naanwijzen warmtebedrijf","Warmtebedrijf/exploitant (kan Gemeente zijn):\n-\tInfrastructuur net/leidingen\n-\tOntwikkeling bron\n-\tCentrale warmtepompen en regeltechniek\n-\tOnderhoudskosten\nEindgebruiker (eventueel via Woningcorporatie/verhuurder):\n-\tAansluitkosten\n-\t(eventuele) Isolatiekosten om aangesloten te kunnen worden\n-Gebruikskosten/warmteafname\n-\tVaste maandelijkse lasten voor onderhoud\nLet op: Uiteindelijke kostenverdeling hangt af van keuzes en governance binnen het project en kunnen in wisselende mate bij de gebruiker of het warmtebedrijf liggen","haalbaarheid en potentie systemen; organisatie; kostenverdeling","Bewonersinitiatieven; netbeheerder; beleidsafdeling Ruimtelijke ordening","Vanaf energielabel C zijn aanvullende isolatiemaatregelen nodig. Gemeente kan dit stimuleren via collectieve inkoopacties en subsidies. LET OP: hoe hoger het energielabel/isolatie, hoe lager de elektriciteitskosten en hoe grotere energiebesparing","Kiezen voor deze warmteoplossing betekent een voorkeur uitspreken voor een collectief systeem dat zeer lokaal kan worden ontwikkeld. De oplossing vereist Ruimte en netcapaciteit, maar kan meerdere huizen gelijktijdig aardgasvrij maken. Het biedt Ruimte voor bewonersinitatieven en er is geen natuurlijke bron nodig. Afstemming over opslag en eigenaarschap is noodzakelijk. Technologie is momenteel erg kostbaar en vraagt om een back-up systeem, waardoor uitvoerbaarheid onzeker is."]
["Warmtenet","Sportveld thermie LT (met WKO)","Warmtenet - Sportveld thermie LT (met WKO)",{"$f":"VLOOKUP(Tabel3[[#This Row],[Warmtebron & type net]],'A. Breakdown'!$D$3:$G$64,4,FALSE)","v":"Een LT-warmtenet op basis van sportveld thermie, inclusief WKO"},"Sportvelden leveren warmte aan een WKO-buffer, dat via een centrale warmtepomp in het warmtenet wordt verspreid. Dit systeem werkt op LT-niveau (25-50°C), maakt gebruik van een centrale warmtepomp en levert warmte via vloerverwarming, lage temperatuur radiatoren of convectoren.","Aanwezigheid sportveld; Voldoende Ruimte op elektriciteitsnet; Voldoende afzet","Kansrijk bij nieuwbouw met aanleg sportveld; Bij bestaande bouw alleen toepasbaar bij nabijheid sportveld.","Bron kan Gemeentelijk bezit zijn, waardoor ontwikkeling sneller kan gaan;\nKansrijk bij middelgrote (200 tot 500 weq) dorpen en compacte wijken;\nKansrijk bij appartementen en rijtjeshuizen","Warmtenet moet ontwikkeld worden, waarin de Gemeente een mogelijke rol kan spelen - dit betekent nadenken over investering en financiering; haalbaarheid en potentie moet onderzocht worden; techniek is innovatief en in pilotfase, dit zorgt voor langere ontwikkeltijd. Gemeente moet nadenken over tijdspad en planning; Gemeente moet afstemmen met eigenaren sportvelden (indien van toepassing);\naanwijzen warmtebedrijf","Warmtebedrijf/exploitant (kan Gemeente zijn):\n-\tInfrastructuur net/leidingen\n-\tOntwikkeling bron\n-\tCentrale warmtepompen en regeltechniek\n-\tOnderhoudskosten\nEindgebruiker (eventueel via Woningcorporatie/verhuurder):\n-\tAansluitkosten\n-\t(eventuele) Isolatiekosten om aangesloten te kunnen worden\n-Gebruikskosten/warmteafname\n-\tVaste maandelijkse lasten voor onderhoud\nLet op: Uiteindelijke kostenverdeling hangt af van keuzes en governance binnen het project en kunnen in wisselende mate bij de gebruiker of het warmtebedrijf liggen","Potentie bron;\nRuimte in ondergrond voor warmtenet;\nRuimte in ondergrond voor WKO;\nOrganisatie en rolneming/eigenaarschap;\nRuimte ondergrond","Eigenaren sportvelden; netbeheerder; beleidsafdeling ondergrond;","Vanaf energielabel C zijn aanvullende isolatiemaatregelen nodig. Gemeente kan dit stimuleren via collectieve inkoopacties en subsidies. LET OP: hoe hoger het energielabel/isolatie, hoe lager de elektriciteitskosten en hoe grotere energiebesparing","Kiezen voor deze warmteoplossing betekent een voorkeur uitspreken voor een kleinschalige collectieve oplossing die integratie met infrastructuur vereist. Systeem biedt mogelijkheid om groter deel van de Gemeente in een keer aardgasvrij te maken.\nSysteem vraagt om goede isolatiegraad van gebouwen, waarbij de kosten doorgaans bij de individuele gebruiker komen te liggen. De Gemeente zal hier over moeten nadenken Bron-locatie kan Gemeentelijk bezit zijn, waardoor ontwikkeling sneller kan gaan.\nDe techniek is nog in ontwikkeling\nDe techniek vraagt om opslag en back-up.\nGemeente moet afstemmen over investering in innovatie."]
["Warmtenet","Sportveld thermie MT (met WKO)","Warmtenet - Sportveld thermie MT (met WKO)",{"$f":"VLOOKUP(Tabel3[[#This Row],[Warmtebron & type net]],'A. Breakdown'!$D$3:$G$64,4,FALSE)","v":"Een MT-warmtenet op basis van sportveld thermie, inclusief WKO"},"Sportvelden leveren warmte aan een WKO-buffer, dat via een centrale warmtepomp in het warmtenet wordt verspreid. Dit systeem werkt op MT-niveau (50-75°C), maakt gebruik van een centrale warmtepomp en levert warmte via vloerverwarming, lage temperatuur radiatoren of convectoren.","Aanwezigheid sportveld; Voldoende Ruimte op elektriciteitsnet; Voldoende afzet","Minder kKansrijk bij nieuwbouw ivm goede isolatiegraad gebouw; Bij bestaande bouw alleen toepasbaar bij nabijheid sportveld.","Bron kan Gemeentelijk bezit zijn, waardoor ontwikkeling sneller kan gaan;\nKansrijk bij middelgrote (200 tot 500 weq) dorpen en compacte wijken;\nKansrijk bij appartementen en rijtjeshuizen","Techniek is innovatief en in pilotfase, dit zorgt voor langere ontwikkeltijd. Gemeente moet nadenken over tijdspad en planning;\nGemeente moet afstemmen met eigenaren sportvelden (indien zijzelf niet bevoegd gezag zijn);\nWarmtenet moet ontwikkeld worden, waarin de Gemeente een mogelijke rol kan spelen - dit betekent nadenken over investering en financiering; \nhaalbaarheid en potentie moet onderzocht worden;  \naanwijzen warmtebedrijf","Warmtebedrijf/exploitant (kan Gemeente zijn):\n-\tInfrastructuur net/leidingen\n-\tOntwikkeling bron\n-\tCentrale warmtepompen en regeltechniek\n-\tOnderhoudskosten\nEindgebruiker (eventueel via Woningcorporatie/verhuurder):\n-\tAansluitkosten\n-\t(eventuele) Isolatiekosten om aangesloten te kunnen worden\n-Gebruikskosten/warmteafname\n-\tVaste maandelijkse lasten voor onderhoud\nLet op: Uiteindelijke kostenverdeling hangt af van keuzes en governance binnen het project en kunnen in wisselende mate bij de gebruiker of het warmtebedrijf liggen","Potentie;\nhaalbaarheid;\nontwikkeltraject;\nOrganisatie en rolneming/eigenaarschap;\nRuimte ondergrond","Eigenaren sportvelden; netbeheerder; beleidsafdeling ondergrond;","Vanaf energielabel D zijn aanvullende isolatiemaatregelen nodig. Gemeente kan dit stimuleren via collectieve inkoopacties en subsidies. LET OP: hoe hoger het energielabel/isolatie, hoe lager de elektriciteitskosten en hoe grotere energiebesparing","Kiezen voor deze warmteoplossing betekent een voorkeur uitspreken voor een kleinschalige collectieve oplossing die integratie met infrastructuur vereist. Systeem biedt mogelijkheid om groter deel van de Gemeente in een keer aardgasvrij te maken.\nSysteem vraagt om goede isolatiegraad van gebouwen, waarbij de kosten doorgaans bij de individuele gebruiker komen te liggen. De Gemeente zal hier over moeten nadenken Bron-locatie kan Gemeentelijk bezit zijn, waardoor ontwikkeling sneller kan gaan.\nDe techniek is nog in ontwikkeling\nDe techniek vraagt om opslag en back-up.\nGemeente moet afstemmen over investering in innovatie."]
["Warmtenet","Thermische energie uit afvalwater - leidingen (TEA)​ LT","Warmtenet - Thermische energie uit afvalwater - leidingen (TEA)​ LT",{"$f":"VLOOKUP(Tabel3[[#This Row],[Warmtebron & type net]],'A. Breakdown'!$D$3:$G$64,4,FALSE)","v":"Een LT-warmtenet op basis van afvalwater aquathermie (TEA) uit leidingen"},"Warmte wordt onttrokken aan afvalwater in rioolleidingen via een warmtewisselaar en collectieve warmtepomp.","Voldoende Ruimte elektriciteitsnet;\nVoldoende isolatie;\naanwezigheid geschikte leidingen;\nBron aanwezig;\nwaterwinning kan beperkend werken; aanvullende eisen hygiene","Toepasbaar bij zowel nieuwbouw als bestaande bouw; Bij bestaande bouw afhankelijk van leidingstructuur.","Goed geïsoleerde huizen; \nKansrijk bij kleine tot midden (200 tot 500 weq) kernen;\nKansrijk bij hoogbouw en rijtjeshuizen","Warmtenet moet ontwikkeld worden, waarin de Gemeente een mogelijke rol kan spelen - dit betekent nadenken over investering en financiering; ","Warmtebedrijf/exploitant (kan Gemeente zijn):\n-\tInfrastructuur net/leidingen\n-\tOntwikkeling bron\n-\tCentrale warmtepompen en regeltechniek\n-\tOnderhoudskosten\nEindgebruiker (eventueel via Woningcorporatie/verhuurder):\n-\tAansluitkosten\n-\t(eventuele) Isolatiekosten om aangesloten te kunnen worden\n-Gebruikskosten/warmteafname\n-\tVaste maandelijkse lasten voor onderhoud\nLet op: Uiteindelijke kostenverdeling hangt af van keuzes en governance binnen het project en kunnen in wisselende mate bij de gebruiker of het warmtebedrijf liggen","Ruimte ondergrond; wel of geen waterwinningsgebied van toepassing","Eigenaar RWZI;\nBeleidsafdeling Ondergrond;\nAangrenzende Gemeenten","Vanaf energielabel C zijn aanvullende isolatiemaatregelen nodig. Gemeente kan dit stimuleren via collectieve inkoopacties en subsidies. LET OP: hoe hoger het energielabel/isolatie, hoe lager de elektriciteitskosten en hoe grotere energiebesparing","Kiezen voor deze warmteoplossing betekent een voorkeur uitspreken voor een collectief systeem met individuele opwaardering. Dit betekent energzijds gelijktijdigheid van collectiviteit, maar vraagt om investering en aanpassingen van individuele gebouweigenaar. De oplossing biedt een mogelijkheid tot koeling. De investeringskosten kunnen hoog uitvallen, dit vraagt om een visie om eerlijke verdeling"]
["Warmtenet","Thermische energie uit afvalwater - leidingen (TEA)​ MT","Warmtenet - Thermische energie uit afvalwater - leidingen (TEA)​ MT",{"$f":"VLOOKUP(Tabel3[[#This Row],[Warmtebron & type net]],'A. Breakdown'!$D$3:$G$64,4,FALSE)","v":"Een MT-warmtenet op basis van afvalwater aquathermie (TEA) uit leidingen"},"Restwarmte uit afvalwaterleidingen wordt centraal benut en via het warmtenet verspreid. Dit systeem werkt op MT-niveau (50-75°C) en wordt centraal opgewaardeerd. Maakt gebruik van een centrale warmtepomp en levert warmte via vloerverwarming, lage temperatuur radiatoren of convectoren.","Aanwezigheid bron;\nVoldoende potentie;\nRuimte op het elektriciteitsnet;\n","Minder geschikt voor nieuwbouw door goede initiele isolatie; \nBij bestaande bouw afhankelijk van ligging en netcapaciteit voor opwaardering bron.","Goed geïsoleerde huizen; \nKansrijk bij kleine tot midden (200 tot 500 weq) kernen;\nKansrijk bij hoogbouw en rijtjeshuizen","Warmtenet moet ontwikkeld worden, waarin de Gemeente een mogelijke rol kan spelen - dit betekent nadenken over investering en financiering; ","Warmtebedrijf/exploitant (kan Gemeente zijn):\n-\tInfrastructuur net/leidingen\n-\tOntwikkeling bron\n-\tCentrale warmtepompen en regeltechniek\n-\tOnderhoudskosten\nEindgebruiker (eventueel via Woningcorporatie/verhuurder):\n-\tAansluitkosten\n-\t(eventuele) Isolatiekosten om aangesloten te kunnen worden\n-Gebruikskosten/warmteafname\n-\tVaste maandelijkse lasten voor onderhoud\nLet op: Uiteindelijke kostenverdeling hangt af van keuzes en governance binnen het project en kunnen in wisselende mate bij de gebruiker of het warmtebedrijf liggen","Ruimte op het elektriciteitsnet; Ruimte ondergrond; potentie bron en systeem;\nafhankelijkheid eigenaar bron;\nAanvullende eisen hygiene","Eigenaar RWZI;\nmogelijk aangrenzende Gemeenten;\nbeleidsafdelingen Gemeente juridica en ondergrond","Vanaf energielabel D zijn aanvullende isolatiemaatregelen nodig. Gemeente kan dit stimuleren via collectieve inkoopacties en subsidies. LET OP: hoe hoger het energielabel/isolatie, hoe lager de elektriciteitskosten en hoe grotere energiebesparing","Kiezen voor deze warmteoplossing betekent een voorkeur uitspreken voor een collectief systeem. hierdoor kunnen mogelijk een groter aantal gebouwen in een keer aardgasvrij gemaakt worden.\nBron wordt opgewaardeerd - dit vraagt om voldoende Ruimte op het elektriciteitsnet. Systeem is afhankelijk van externe eigenaar, waar rekening mee gehouden moet worden. Het systeem biedt geen mogelijkheid tot koeling, hiervoor is een oplossing nodig;"]
["Warmtenet","Thermische energie uit afvalwater - RWZI (TEA)​ LT","Warmtenet - Thermische energie uit afvalwater - RWZI (TEA)​ LT",{"$f":"VLOOKUP(Tabel3[[#This Row],[Warmtebron & type net]],'A. Breakdown'!$D$3:$G$64,4,FALSE)","v":"Een LT-warmtenet op basis van afvalwater aquathermie (TEA) uit de RWZI"},"Restwarmte uit RWZI wordt via een centrale warmtepomp aan het warmtenet geleverd. Dit systeem werkt op LT-niveau (25-75°C), maakt gebruik van een centrale warmtepomp en levert warmte via vloerverwarming, lage temperatuur radiatoren of convectoren.","Aanwezigheid bron;\nVoldoende potentie;\nRuimte op het elektriciteitsnet;\nvoldoene isolatie gebouwen;\nVoldoende afzet","Toepasbaar Bij bestaande bouw met nabijheid RWZI; bij nieuwbouw Kansrijk bij hoge dichtheid.","Goed geïsoleerde huizen; \nKansrijk bij kleine tot midden (200 tot 500 weq) kernen;\nKansrijk bij hoogbouw en rijtjeshuizen","Warmtenet moet ontwikkeld worden, waarin de Gemeente een mogelijke rol kan spelen - dit betekent nadenken over investering en financiering; \nhaalbaarheid en potentie moet onderzocht worden;  \naanwijzen warmtebedrijf","Warmtebedrijf/exploitant (kan Gemeente zijn):\n-\tInfrastructuur net/leidingen\n-\tOntwikkeling bron\n-\tCentrale warmtepompen en regeltechniek\n-\tOnderhoudskosten\nEindgebruiker (eventueel via Woningcorporatie/verhuurder):\n-\tAansluitkosten\n-\t(eventuele) Isolatiekosten om aangesloten te kunnen worden\n-Gebruikskosten/warmteafname\n-\tVaste maandelijkse lasten voor onderhoud\nLet op: Uiteindelijke kostenverdeling hangt af van keuzes en governance binnen het project en kunnen in wisselende mate bij de gebruiker of het warmtebedrijf liggen","Ruimte op het elektriciteitsnet; Ruimte ondergrond; potentie bron en systeem;\nafhankelijkheid eigenaar bron","Eigenaar RWZI;\nmogelijk aangrenzende Gemeenten;\nbeleidsafdelingen Gemeente juridica en ondergrond","Vanaf energielabel D zijn aanvullende isolatiemaatregelen nodig. Gemeente kan dit stimuleren via collectieve inkoopacties en subsidies en/of gerichte isolatiestrategie. LET OP: hoe hoger het energielabel/isolatie, hoe lager de elektriciteitskosten en hoe grotere energiebesparing","Kiezen voor deze warmteoplossing betekent een voorkeur uitspreken voor een collectief systeem. hierdoor kunnen mogelijk een groter aantal gebouwen in een keer aardgasvrij gemaakt worden.\nSysteem vraagt om goed geïsoleerde gebouwen, dit vraagt om een gerichte strategie vanuit de Gemeente en/of individuele investeringskosten. Systeem is afhankelijk van externe eigenaar, waar rekening mee gehouden moet worden. Het systeem biedt geen mogelijkheid tot koeling, hiervoor is een oplossing nodig;"]
["Warmtenet","Thermische energie uit afvalwater - RWZI (TEA)​ LT + WKO","Warmtenet - Thermische energie uit afvalwater - RWZI (TEA)​ LT + WKO",{"$f":"VLOOKUP(Tabel3[[#This Row],[Warmtebron & type net]],'A. Breakdown'!$D$3:$G$64,4,FALSE)","v":"Een LT-warmtenet op basis van afvalwater aquathermie (TEA) uit de RWZI, inclusief WKO"},"Restwarmte uit RWZI wordt via een centrale warmtepomp aan het warmtenet geleverd. Dit systeem werkt op LT-niveau (25-75°C), maakt gebruik van een centrale warmtepomp en levert warmte via vloerverwarming, lage temperatuur radiatoren of convectoren.","Aanwezigheid bron;\nVoldoende isolatie;\nRuimte ondergrond WKO en leidingen;","Toepasbaar Bij bestaande bouw met nabijheid van RWZI; bij nieuwbouw Kansrijk bij hoge dichtheid en goede isolatie.","Goed geïsoleerde huizen; \nKansrijk bij kleine tot midden (200 tot 500 weq) kernen;\nKansrijk bij hoogbouw en rijtjeshuizen","Warmtenet moet ontwikkeld worden, waarin de Gemeente een mogelijke rol kan spelen - dit betekent nadenken over investering en financiering; ","Warmtebedrijf/exploitant (kan Gemeente zijn):\n-\tInfrastructuur net/leidingen\n-\tOntwikkeling bron\n-\tCentrale warmtepompen en regeltechniek\n-\tOnderhoudskosten\nEindgebruiker (eventueel via Woningcorporatie/verhuurder):\n-\tAansluitkosten\n-\t(eventuele) Isolatiekosten om aangesloten te kunnen worden\n-Gebruikskosten/warmteafname\n-\tVaste maandelijkse lasten voor onderhoud\nLet op: Uiteindelijke kostenverdeling hangt af van keuzes en governance binnen het project en kunnen in wisselende mate bij de gebruiker of het warmtebedrijf liggen","Ruimte op het elektriciteitsnet; Ruimte ondergrond; potentie bron en systeem;\nafhankelijkheid eigenaar bron","Eigenaar RWZI;\nmogelijk aangrenzende Gemeenten;\nbeleidsafdelingen Gemeente juridica en ondergrond","Vanaf energielabel D zijn aanvullende isolatiemaatregelen nodig. Gemeente kan dit stimuleren via collectieve inkoopacties en subsidies. LET OP: hoe hoger het energielabel/isolatie, hoe lager de elektriciteitskosten en hoe grotere energiebesparing","Kiezen voor deze warmteoplossing betekent een voorkeur uitspreken voor een collectief systeem, dat toepasbaar is bij een relatief lage isolatiegraad (d en hoger). Dit biedt kansen voor slechter te isoleren gebouwen en inwoners die minder draagkrachtig zijn. Systeem is afhankelijk van externe eigenaar, waar rekening mee gehouden moet worden. Kosten kunnen collectief verdeeld worden om inclusiviteit te bevorderen. Het systeem biedt mogelijkheid tot koeling"]
["Warmtenet","Thermische energie uit afvalwater - RWZI (TEA)​ MT","Warmtenet - Thermische energie uit afvalwater - RWZI (TEA)​ MT",{"$f":"VLOOKUP(Tabel3[[#This Row],[Warmtebron & type net]],'A. Breakdown'!$D$3:$G$64,4,FALSE)","v":"Een MT-warmtenet op basis van afvalwater aquathermie (TEA) uit de RWZI"},"Restwarmte uit RWZI wordt via een centrale warmtepomp aan het warmtenet geleverd. Dit systeem werkt op MT-niveau (50-75°C), maakt gebruik van een centrale warmtepomp en levert warmte via vloerverwarming, lage temperatuur radiatoren of convectoren.","Aanwezigheid bron;\nVoldoende potentie;\nRuimte op het elektriciteitsnet;\nVoldoende afzet","Minder geschikt voor nieuwbouw door goede initiele isolatie; Bij bestaande bouw afhankelijk van ligging en netcapaciteit voor opwaardering bron.","Goed minder goed te isoleren gebouwen; \nKansrijk bij kleine tot midden (200 tot 500 weq) kernen;\nKansrijk bij hoogbouw en rijtjeshuizen","Warmtenet moet ontwikkeld worden, waarin de Gemeente een mogelijke rol kan spelen - dit betekent nadenken over investering en financiering; \nhaalbaarheid en potentie moet onderzocht worden;  \naanwijzen warmtebedrijf","Warmtebedrijf/exploitant (kan Gemeente zijn):\n-\tInfrastructuur net/leidingen\n-\tOntwikkeling bron\n-\tCentrale warmtepompen en regeltechniek\n-\tOnderhoudskosten\nEindgebruiker (eventueel via Woningcorporatie/verhuurder):\n-\tAansluitkosten\n-\t(eventuele) Isolatiekosten om aangesloten te kunnen worden\n-Gebruikskosten/warmteafname\n-\tVaste maandelijkse lasten voor onderhoud\nLet op: Uiteindelijke kostenverdeling hangt af van keuzes en governance binnen het project en kunnen in wisselende mate bij de gebruiker of het warmtebedrijf liggen","Ruimte op het elektriciteitsnet; Ruimte ondergrond; potentie bron en systeem;\nafhankelijkheid eigenaar bron","Eigenaar RWZI;\nmogelijk aangrenzende Gemeenten;\nbeleidsafdelingen Gemeente juridica en ondergrond","Vanaf energielabel D zijn aanvullende isolatiemaatregelen nodig. Gemeente kan dit stimuleren via collectieve inkoopacties en subsidies. LET OP: hoe hoger het energielabel/isolatie, hoe lager de elektriciteitskosten en hoe grotere energiebesparing","Kiezen voor deze warmteoplossing betekent een voorkeur uitspreken voor een collectief systeem. hierdoor kunnen mogelijk een groter aantal gebouwen in een keer aardgasvrij gemaakt worden.\nBron wordt opgewaardeerd - dit vraagt om voldoende Ruimte op het elektriciteitsnet. Systeem is afhankelijk van externe eigenaar, waar rekening mee gehouden moet worden. Het systeem biedt geen mogelijkheid tot koeling, hiervoor is een oplossing nodig;"]
["Warmtenet","Thermische energie uit afvalwater - RWZI (TEA)​ MT + WKO","Warmtenet - Thermische energie uit afvalwater - RWZI (TEA)​ MT + WKO",{"$f":"VLOOKUP(Tabel3[[#This Row],[Warmtebron & type net]],'A. Breakdown'!$D$3:$G$64,4,FALSE)","v":"Een MT-warmtenet op basis van afvalwater aquathermie (TEA) uit de RWZI, inclusief WKO"},"Restwarmte uit RWZI wordt via een centrale warmtepomp aan het warmtenet geleverd. Dit systeem werkt op MT-niveau (50-75°C), maakt gebruik van een centrale warmtepomp en levert warmte via vloerverwarming, lage temperatuur radiatoren of convectoren.","Aanwezigheid bron;\nVoldoende potentie;\nRuimte op het elektriciteitsnet;\nVoldoende afzet;\nRuimte WKO","Minder geschikt voor nieuwbouw door goede initiele isolatie; Bij bestaande bouw afhankelijk van ligging en netcapaciteit voor opwaardering bron.","Goed minder goed te isoleren gebouwen; \nKansrijk bij kleine tot midden (200 tot 500 weq) kernen;\nKansrijk bij hoogbouw en rijtjeshuizen","Warmtenet moet ontwikkeld worden, waarin de Gemeente een mogelijke rol kan spelen - dit betekent nadenken over investering en financiering; \nhaalbaarheid en potentie moet onderzocht worden;  \naanwijzen warmtebedrijf","Warmtebedrijf/exploitant (kan Gemeente zijn):\n-\tInfrastructuur net/leidingen\n-\tOntwikkeling bron\n-\tCentrale warmtepompen en regeltechniek\n-\tOnderhoudskosten\nEindgebruiker (eventueel via Woningcorporatie/verhuurder):\n-\tAansluitkosten\n-\t(eventuele) Isolatiekosten om aangesloten te kunnen worden\n-Gebruikskosten/warmteafname\n-\tVaste maandelijkse lasten voor onderhoud\nLet op: Uiteindelijke kostenverdeling hangt af van keuzes en governance binnen het project en kunnen in wisselende mate bij de gebruiker of het warmtebedrijf liggen","Ruimte op het elektriciteitsnet; Ruimte ondergrond; potentie bron en systeem;\nafhankelijkheid eigenaar bron","Eigenaar RWZI;\nNetbeheerder\nmogelijk aangrenzende Gemeenten;\nbeleidsafdelingen Gemeente juridica en ondergrond","Vanaf energielabel D zijn aanvullende isolatiemaatregelen nodig. Gemeente kan dit stimuleren via collectieve inkoopacties en subsidies. LET OP: hoe hoger het energielabel/isolatie, hoe lager de elektriciteitskosten en hoe grotere energiebesparing","Kiezen voor deze warmteoplossing betekent een voorkeur uitspreken voor een collectief systeem. hierdoor kunnen mogelijk een groter aantal gebouwen in een keer aardgasvrij gemaakt worden.\nBron wordt opgewaardeerd - dit vraagt om voldoende Ruimte op het elektriciteitsnet. Systeem is afhankelijk van externe eigenaar, waar rekening mee gehouden moet worden. Het systeem biedt mogelijkheid tot koeling, hiervoor is goed onderzoek naar haalbaarheid in de ondergrond nodig;"]
["Warmtenet","Thermische energie uit drinkwater (TED)​ LT","Warmtenet - Thermische energie uit drinkwater (TED)​ LT",{"$f":"VLOOKUP(Tabel3[[#This Row],[Warmtebron & type net]],'A. Breakdown'!$D$3:$G$64,4,FALSE)","v":"Een LT-warmtenet op basis van drinkwater aquathermie (TED)"},"Drinkwaterleidingen leveren thermische energie aan een centrale warmtepomp, die via het warmtenet verspreidt. Dit systeem werkt op LT-niveau (25-50°C), maakt gebruik van een centrale warmtepomp en levert warmte via vloerverwarming, lage temperatuur radiatoren of convectoren.","Bron aanwezig;\nGeen inteverenties met hygiene-standaarden;\nRuimte op het elektriciteitsnet;\nVoldoende afzet;\nRuimte ondergrond voor warmtenet","Kansrijk bij nieuwbouw met hoge dichtheid; Bij bestaande bouw technisch complex.","Bron op veel plaatsen aanwezig, maakt de oplossing Kansrijker;\nKansrijk bij kernen met gestapelde bouw;\nKansrijk bij kernen met een hoge warmtedichtheid;\nKansrijk bij midden tot grote kernen (200 tot 500 weq)","Warmtebedrijf moet ontwikkeld worden, dit vraagt om coördinatie en regie;\nGemeente moet nadenken over planning, governance en financiering;\nWarmtenet vraag Voldoende Ruimte op elektriciteitsnet voor opwaardering en Voldoende isolatie","Warmtebedrijf/exploitant (kan Gemeente zijn):\n-\tInfrastructuur net/leidingen\n-\tOntwikkeling bron\n-\tCentrale warmtepompen en regeltechniek\n-\tOnderhoudskosten\nEindgebruiker (eventueel via Woningcorporatie/verhuurder):\n-\tAansluitkosten\n-\t(eventuele) Isolatiekosten om aangesloten te kunnen worden\n-Gebruikskosten/warmteafname\n-\tVaste maandelijkse lasten voor onderhoud\nLet op: Uiteindelijke kostenverdeling hangt af van keuzes en governance binnen het project en kunnen in wisselende mate bij de gebruiker of het warmtebedrijf liggen","Ruimte ondergrond; wel of geen waterwinningsgebied van toepassing; potentie bron","Waterschappen; \nBeleidsafdeling ondergrond;\nNetbeheerder","Vanaf energielabel C zijn aanvullende isolatiemaatregelen nodig. Gemeente kan dit stimuleren via collectieve inkoopacties en subsidies. LET OP: hoe hoger het energielabel/isolatie, hoe lager de elektriciteitskosten en hoe grotere energiebesparing","Kiezen voor deze warmteoplossing betekent een voorkeur uitspreken voor een collectief systeem met centrale opwaardering. Dit betekent energzijds gelijktijdigheid van collectiviteit;\nAquathermie vraagt doorgaans veel extra energie, dus er moet voldoende Ruimte op het net zijn.\nLT-oplossing vraagt om hoge isolatiegraad De oplossing is technisch complex vanwege hygiëneregels en beperkt toepasbaar. Kansrijk bij goed geïsoleerde gebouwen en hoge warmtedichtheid. Deze oplossing biedt geen mogelijkheid tot koeling."]
["Warmtenet","Thermische energie uit drinkwater (TED)​ LT + WKO","Warmtenet - Thermische energie uit drinkwater (TED)​ LT + WKO",{"$f":"VLOOKUP(Tabel3[[#This Row],[Warmtebron & type net]],'A. Breakdown'!$D$3:$G$64,4,FALSE)","v":"Een LT-warmtenet op basis van drinkwater aquathermie (TED), inclusief WKO"},"Drinkwaterleidingen leveren thermische energie aan een centrale warmtepomp, die via het warmtenet verspreidt. Dit systeem werkt op MT-niveau (25-50°C), maakt gebruik van een centrale warmtepomp en levert warmte via vloerverwarming, lage temperatuur radiatoren of convectoren. De WKO zorgt voor koeling in de zomer, kan warmte opslaan en als piekbron worden gebruikte in de winter.","Geen inteverenties met hygiene-standaarden;\nAanwezigheid bron;\nVoldoende potentie;\nRuimte in de ondergrond voor WKO;\nGeen restricties waterwinningsgebied\nRuimte op elektriciteitsnet\nVoldoende afzet","Kansrijk bij nieuwbouw met hoge dichtheid; Bij bestaande bouw technisch complex.","Bron op veel plaatsen aanwezig, maakt de oplossing Kansrijker;\nKansrijk bij kernen met gestapelde bouw;\nKansrijk bij kernen met een hoge warmtedichtheid;\nKansrijk bij midden tot grote kernen (200 tot 500 weq)","Warmtebedrijf moet ontwikkeld worden, dit vraagt om coördinatie en regie;\nGemeente moet nadenken over planning, governance en financiering;\nWarmtenet vraag Voldoende Ruimte op elektriciteitsnet voor opwaardering en Voldoende isolatie","Warmtebedrijf/exploitant (kan Gemeente zijn):\n-\tInfrastructuur net/leidingen\n-\tOntwikkeling bron\n- Ontwikkeling WKO\n-\tCentrale warmtepompen en regeltechniek\n-\tOnderhoudskosten\nEindgebruiker (eventueel via Woningcorporatie/verhuurder):\n-\tAansluitkosten\n-\t(eventuele) Isolatiekosten om aangesloten te kunnen worden\n-Gebruikskosten/warmteafname\n-\tVaste maandelijkse lasten voor onderhoud\nLet op: Uiteindelijke kostenverdeling hangt af van keuzes en governance binnen het project en kunnen in wisselende mate bij de gebruiker of het warmtebedrijf liggen","Ruimte op het elektriciteitsnet; Ruimte ondergrond; potentie bron en systeem;\nrestricties waterwinningsgebied;\nRuimte ondergrond voor wko","Waterschappen\nmogelijk aangrenzende Gemeenten;\nbeleidsafdelingen Gemeente juridica en ondergrond","Vanaf energielabel C zijn aanvullende isolatiemaatregelen nodig. Gemeente kan dit stimuleren via collectieve inkoopacties en subsidies. LET OP: hoe hoger het energielabel/isolatie, hoe lager de elektriciteitskosten en hoe grotere energiebesparing","Kiezen voor deze warmteoplossing betekent een voorkeur uitspreken voor een collectief systeem met centrale opwaardering. Dit betekent energzijds gelijktijdigheid van collectiviteit;\nAquathermie vraagt doorgaans veel extra energie, dus er moet Voldoende Ruimte op het net zijn.\nLT-oplossing vraagt om hoge isolatiegraad De oplossing is technisch complex vanwege hygiëneregels en beperkt toepasbaar. Kansrijk bij goed geïsoleerde gebouwen en hoge warmtedichtheid. Deze oplossing biedt mogelijkheid tot koeling en gebruikt de WKO voor de piekvoorziening."]
["Warmtenet","Thermische energie uit drinkwater (TED)​ MT","Warmtenet - Thermische energie uit drinkwater (TED)​ MT",{"$f":"VLOOKUP(Tabel3[[#This Row],[Warmtebron & type net]],'A. Breakdown'!$D$3:$G$64,4,FALSE)","v":"Een MT-warmtenet op basis van drinkwater aquathermie (TED)"},"Drinkwaterleidingen leveren thermische energie aan een centrale warmtepomp, die via het warmtenet verspreidt. Dit systeem werkt op MT-niveau (50-75°C), maakt gebruik van een centrale warmtepomp en levert warmte via vloerverwarming, lage temperatuur radiatoren of convectoren.","Geen inteverenties met hygiene-standaarden;\nAanwezigheid bron;\nVoldoende potentie;\nRuimte op het elektriciteitsnet;\nVoldoende afzet","Minder geschikt voor nieuwbouw door goede initiele isolatie; Bij bestaande bouw afhankelijk van ligging en netcapaciteit voor opwaardering bron.","Bron is op veel plaatsen aanwezig;\nWKO zorgt voor opvang piekvraag;\nKansrijk bij grote dorpen (200 tot 500 weq) en stedelijke kernen;\n Kansrijk bij rijgebouwen en appartementen; \nToepasbaar bij slechter te isoleren gebouwen;\n\nKansrijk bij slecht te isoleren gebouwen;\nKansrijk in gebieden met een hogere warmtevraagdichtheid","Warmtebedrijf moet ontwikkeld worden, dit vraagt om coördinatie en regie;\nGemeente moet nadenken over planning, governance en financiering;\nWarmtenet vraag voldoende Ruimte op elektriciteitsnet voor opwaardering en voldoende isolatie","Warmtebedrijf/exploitant (kan Gemeente zijn):\n-\tInfrastructuur net/leidingen\n-\tOntwikkeling bron\n-\tCentrale warmtepompen en regeltechniek\n-\tOnderhoudskosten\nEindgebruiker (eventueel via Woningcorporatie/verhuurder):\n-\tAansluitkosten\n-\t(eventuele) Isolatiekosten om aangesloten te kunnen worden\n-Gebruikskosten/warmteafname\n-\tVaste maandelijkse lasten voor onderhoud\nLet op: Uiteindelijke kostenverdeling hangt af van keuzes en governance binnen het project en kunnen in wisselende mate bij de gebruiker of het warmtebedrijf liggen","Ruimte op het elektriciteitsnet; Ruimte ondergrond; potentie bron en systeem;\nrestricties waterwinningsgebied","Waterschappen\nmogelijk aangrenzende Gemeenten;\nbeleidsafdelingen Gemeente juridica en omgeving","Vanaf energielabel D zijn aanvullende isolatiemaatregelen nodig. Gemeente kan dit stimuleren via collectieve inkoopacties en subsidies. LET OP: hoe hoger het energielabel/isolatie, hoe lager de elektriciteitskosten en hoe grotere energiebesparing","Kiezen voor deze warmteoplossing betekent een voorkeur uitspreken voor een collectief systeem met centrale opwaardering. Dit betekent energzijds gelijktijdigheid van collectiviteit.\nMT-oplossing vraagt om lagere isolatiegraad maar meer elektriciteit De oplossing is technisch complex vanwege hygiëneregels en beperkt toepasbaar. Kansrijk bij goed geïsoleerde gebouwen en hoge warmtedichtheid. Deze oplossing biedt geen mogelijkheid tot koeling."]
["Warmtenet","Thermische energie uit drinkwater (TED)​ MT + WKO","Warmtenet - Thermische energie uit drinkwater (TED)​ MT + WKO",{"$f":"VLOOKUP(Tabel3[[#This Row],[Warmtebron & type net]],'A. Breakdown'!$D$3:$G$64,4,FALSE)","v":"Een MT-warmtenet op basis van drinkwater aquathermie (TED), inclusief WKO"},"Drinkwaterleidingen leveren thermische energie aan een centrale warmtepomp, die via het warmtenet verspreidt. Dit systeem werkt op MT-niveau (50-75°C), maakt gebruik van een centrale warmtepomp en levert warmte via vloerverwarming, lage temperatuur radiatoren of convectoren. De WKO zorgt voor koeling in de zomer, kan warmte opslaan en als piekbron worden gebruikte in de winter","Geen inteverenties met hygiene-standaarden;\nAanwezigheid bron;\nVoldoende potentie;\nRuimte in de ondergrond voor WKO;\nRuimte op elektriciteitsnet\nVoldoende afzet","Minder geschikt voor nieuwbouw door goede initiele isolatie; Bij bestaande bouw afhankelijk van ligging, Ruimte voor WKO en netcapaciteit voor opwaardering bron.","Bron is op veel plaatsen aanwezig;\nWKO zorgt voor opvang piekvraag;\nKansrijk bij grote dorpen (200 tot 500 weq) en stedelijke kernen;\n Kansrijk bij rijgebouwen en appartementen; \nToepasbaar bij slechter te isoleren gebouwen;\n\nKansrijk bij slecht te isoleren gebouwen;\nKansrijk in gebieden met een hogere warmtevraagdichtheid","Warmtebedrijf moet ontwikkeld worden, dit vraagt om coördinatie en regie;\nGemeente moet nadenken over planning, governance en financiering;\nWarmtenet vraag voldoende Ruimte op elektriciteitsnet voor opwaardering en voldoende isolatie","Warmtebedrijf/exploitant (kan Gemeente zijn):\n-\tInfrastructuur net/leidingen\n-\tOntwikkeling bron\n-\tCentrale warmtepompen en regeltechniek\n-\tOnderhoudskosten\nEindgebruiker (eventueel via Woningcorporatie/verhuurder):\n-\tAansluitkosten\n-\t(eventuele) Isolatiekosten om aangesloten te kunnen worden\n-Gebruikskosten/warmteafname\n-\tVaste maandelijkse lasten voor onderhoud\nLet op: Uiteindelijke kostenverdeling hangt af van keuzes en governance binnen het project en kunnen in wisselende mate bij de gebruiker of het warmtebedrijf liggen","Ruimte op het elektriciteitsnet; Ruimte ondergrond; potentie bron en systeem;\nrestricties waterwinningsgebied;\nRuimte ondergrond voor wko","Waterschappen\nmogelijk aangrenzende Gemeenten;\nbeleidsafdelingen Gemeente juridica en ondergrond","Vanaf energielabel D zijn aanvullende isolatiemaatregelen nodig. Gemeente kan dit stimuleren via collectieve inkoopacties en subsidies. LET OP: hoe hoger het energielabel/isolatie, hoe lager de elektriciteitskosten en hoe grotere energiebesparing","Kiezen voor deze warmteoplossing betekent een voorkeur uitspreken voor een collectief systeem met centrale opwaardering. Dit betekent energzijds gelijktijdigheid van collectiviteit.\nMT-oplossing vraagt om lagere isolatiegraad maar meer elektriciteit voor centrale opwaardering; De oplossing is technisch complex vanwege hygiëneregels en beperkt toepasbaar. Kansrijk bij goed geïsoleerde gebouwen en hoge warmtedichtheid. Deze oplossing biedt mogelijkheid tot koeling\noplossing heeft geen piekvoorziening nodig"]
["Warmtenet","Thermische energie uit oppervlaktewater (TEO)​ LT","Warmtenet - Thermische energie uit oppervlaktewater (TEO)​ LT",{"$f":"VLOOKUP(Tabel3[[#This Row],[Warmtebron & type net]],'A. Breakdown'!$D$3:$G$64,4,FALSE)","v":"Een LT-warmtenet op basis van oppervlaktewater aquathermie (TEO)"},"Oppervlaktewater levert warmte via een centrale warmtepomp aan het warmtenet. Dit systeem werkt op LT-niveau (25-75°C), maakt gebruik van een centrale warmtepomp en levert warmte via vloerverwarming, lage temperatuur radiatoren of convectoren.","Aanwezigheid bron; Voldoende potentie; Ruimte op het elektriciteitsnet;","Toepasbaar bij zowel nieuwbouw als bestaande bouw; Bij bestaande bouw hogere kosten door isolatie.","Kansrijk bij middengrote dorpen (200 tot 500 weq)en stedelijke kernen; \nKansrijk bij rijgebouwen en appartementen;\nKansrijk bij goed geïsoleerde gebouwen","Warmtenet moet ontwikkeld worden, waarin de Gemeente een mogelijke rol kan spelen - dit betekent nadenken over investering en financiering; haalbaarheid en potentie moet onderzocht worden; Gemeente moet nadenken over tijdspad en planning; aquathermie vraagt veel energie en opwaardering, dus er moet voldoende Ruimte op het net zijn om systeem te ontwikkelen; er moet voldoende Ruimte zijn in de ondergrond voor warmtenet; gebouwen moeten voldoende geisoleerd worden; aanwijzen warmtebedrijf","Warmtebedrijf/exploitant (kan Gemeente zijn):\n-\tInfrastructuur net/leidingen\n-\tOntwikkeling bron\n-\tCentrale warmtepompen en regeltechniek\n-\tOnderhoudskosten\nEindgebruiker (eventueel via Woningcorporatie/verhuurder):\n-\tAansluitkosten\n-\t(eventuele) Isolatiekosten om aangesloten te kunnen worden\n-Gebruikskosten/warmteafname\n-\tVaste maandelijkse lasten voor onderhoud\nLet op: Uiteindelijke kostenverdeling hangt af van keuzes en governance binnen het project en kunnen in wisselende mate bij de gebruiker of het warmtebedrijf liggen","Ruimte op het elektriciteitsnet; Ruimte ondergrond; potentie bron en systeem; implicaties bij waterwinningsgebied","RWS; Provincie; mogelijk aangrenzende Gemeenten; beleidsafdelingen Gemeente juridica en ondergrond","Vanaf energielabel C zijn aanvullende isolatiemaatregelen nodig. Gemeente kan dit stimuleren via collectieve inkoopacties en subsidies. LET OP: hoe hoger het energielabel/isolatie, hoe lager de elektriciteitskosten en hoe grotere energiebesparing","Kiezen voor deze warmteoplossing betekent een voorkeur uitspreken voor een collectief systeem met lage temperatuur, dat veel netcapaciteit vereist. De Gemeente moet afstemmen met netbeheerder en waterschappen. De oplossing is Kansrijk bij hoge warmtedichtheid en goed geïsoleerde gebouwen. Deze oplossing biedt mogelijkheid om in een keer meerdere gebouwen aardgasvrij te maken. Kosten kunnen collectief verdeeld worden om inclusiviteit te bevorderen."]
["Warmtenet","Thermische energie uit oppervlaktewater (TEO)​ LT + WKO","Warmtenet - Thermische energie uit oppervlaktewater (TEO)​ LT + WKO",{"$f":"VLOOKUP(Tabel3[[#This Row],[Warmtebron & type net]],'A. Breakdown'!$D$3:$G$64,4,FALSE)","v":"Een LT-warmtenet op basis van Oppervlaktewater aquathermie (TEO), inclusief WKO"},"Oppervlaktewater levert warmte via een centrale warmtepomp aan het warmtenet. Dit systeem werkt op LT-niveau (25-75°C), maakt gebruik van een centrale warmtepomp en levert warmte via vloerverwarming, lage temperatuur radiatoren of convectoren.","Bron aanwezig; waterwinning kan beperkend werken;\naanvullende eisen hygiene;\nVoldoende Ruimte ondergrond","Kansrijk bij nieuwbouw met hoge warmtedichtheid, nog Ruimte voor WKO en goede isolatie;\nBij bestaande bouw technisch complex en minder toepasbaar.","Kansrijk bij middengrote dorpen (200 tot 500 weq)en stedelijke kernen; \nKansrijk bij rijgebouwen en appartementen;\nKansrijk bij goed geïsoleerde gebouwen","Warmtenet moet ontwikkeld worden, waarin de Gemeente een mogelijke rol kan spelen - dit betekent nadenken over investering, governance en financiering; haalbaarheid en potentie moet onderzocht worden;\nGemeente moet nadenken over tijdspad en planning;\naquathermie vraagt veel energie en opwaardering, dus er moet voldoende Ruimte op het net zijn om systeem te ontwikkelen; er moet voldoende Ruimte zijn in de ondergrond voor warmtenet;\ngebouwen moeten voldoende geisoleerd worden;\n(eventueel) aanwijzen warmtebedrijf of verlenen ontheffing","Warmtebedrijf/exploitant (kan Gemeente zijn):\n-\tInfrastructuur net/leidingen\n-\tOntwikkeling bron\n-\tCentrale warmtepompen en regeltechniek\n-\tOnderhoudskosten\nEindgebruiker (eventueel via Woningcorporatie/verhuurder):\n-\tAansluitkosten\n-\t(eventuele) Isolatiekosten om aangesloten te kunnen worden\n-Gebruikskosten/warmteafname\n-\tVaste maandelijkse lasten voor onderhoud\nLet op: Uiteindelijke kostenverdeling hangt af van keuzes en governance binnen het project en kunnen in wisselende mate bij de gebruiker of het warmtebedrijf liggen","Ruimte op het elektriciteitsnet; Ruimte in de ondergrond; voorkeurspositie Gemeente; potentie aquathermie; restricties waterwinningsgebied; kansen piekvoorziening","netbeheerder;\nmogelijk bewonersinitiatieven;\nbeleidsafdeling Ruimtelijke omgeving;","Vanaf energielabel D zijn grote aanvullende isolatiemaatregelen nodig. Gemeente kan dit stimuleren via collectieve inkoopacties en subsidies. LET OP: hoe hoger het energielabel/isolatie, hoe lager de elektriciteitskosten en hoe grotere energiebesparing","Kiezen voor deze warmteoplossing betekent een voorkeur uitspreken voor een collectief systeem/ Systeem is afhankelijk van externe eigenaar, waar rekening mee gehouden moet worden. Kosten kunnen collectief verdeeld worden om inclusiviteit te bevorderen. Er is geen piekvoorziening nodig;\nAquathermie vraagt doorgaans veel extra energie, dus er moet voldoende Ruimte op het net zijn.\nkiezen voor deze oplossing betekent nadenken over een alternatief voor individuele koeling"]
["Warmtenet","Thermische energie uit oppervlaktewater (TEO)​ MT","Warmtenet - Thermische energie uit oppervlaktewater (TEO)​ MT",{"$f":"VLOOKUP(Tabel3[[#This Row],[Warmtebron & type net]],'A. Breakdown'!$D$3:$G$64,4,FALSE)","v":"Een MT-warmtenet op basis van oppervlaktewater aquathermie (TEO)"},"Oppervlaktewater levert warmte via een centrale warmtepomp aan het warmtenet. Dit systeem werkt op MT-niveau (50-75°C), maakt gebruik van een centrale warmtepomp en levert warmte via vloerverwarming, lage temperatuur radiatoren of convectoren.","Aanwezigheid bron;\nVoldoende potentie;\nRuimte op het elektriciteitsnet;\nVoldoende afzet","Minder geschikt voor nieuwbouw door goede initiele isolatie; Bij bestaande bouw afhankelijk van ligging en netcapaciteit voor opwaardering bron.","Kansrijk bij gebieden in de buurt van water; \nKansrijk bij grote dorpen (1000+)en stedelijke kernen;\n Kansrijk bij rijgebouwen en appartementen; \nKansrijk bij slecht te isoleren gebouwen","Warmtenet moet ontwikkeld worden, waarin de Gemeente een mogelijke rol kan spelen - dit betekent nadenken over investering en financiering; haalbaarheid en potentie moet onderzocht worden; techniek is innovatief en in pilotfase, dit zorgt voor langere ontwikkeltijd. Gemeente moet nadenken over tijdspad en planning; Gemeente moet afstemmen met waterschappen;\naanwijzen warmtebedrijf","Warmtebedrijf/exploitant (kan Gemeente zijn):\n-\tInfrastructuur net/leidingen\n-\tOntwikkeling bron\n-\tCentrale warmtepompen en regeltechniek\n-\tOnderhoudskosten\nEindgebruiker (eventueel via Woningcorporatie/verhuurder):\n-\tAansluitkosten\n-\t(eventuele) Isolatiekosten om aangesloten te kunnen worden\n-Gebruikskosten/warmteafname\n-\tVaste maandelijkse lasten voor onderhoud\nLet op: Uiteindelijke kostenverdeling hangt af van keuzes en governance binnen het project en kunnen in wisselende mate bij de gebruiker of het warmtebedrijf liggen","Ruimte op het elektriciteitsnet; Ruimte ondergrond; potentie bron en systeem;\nrestricties waterwinningsgebied","Waterschappen\nmogelijk aangrenzende Gemeenten;\nbeleidsafdelingen Gemeente juridica en omgeving","Vanaf energielabel D zijn aanvullende isolatiemaatregelen nodig. Gemeente kan dit stimuleren via collectieve inkoopacties en subsidies. LET OP: hoe hoger het energielabel/isolatie, hoe lager de elektriciteitskosten en hoe grotere energiebesparing","Kiezen voor deze warmteoplossing betekent een voorkeur uitspreken voor een collectief systeem met lage temperatuur, dat veel netcapaciteit vereist. De Gemeente moet afstemmen met netbeheerder en waterschappen. De oplossing is Kansrijk bij hoge warmtedichtheid en goed geïsoleerde gebouwen. Deze oplossing biedt mogelijkheid om in een keer meerdere gebouwen aardgasvrij te maken. Kosten kunnen collectief verdeeld worden om inclusiviteit te bevorderen."]
["Warmtenet","Thermische energie uit oppervlaktewater (TEO)​ MT + WKO","Warmtenet - Thermische energie uit oppervlaktewater (TEO)​ MT + WKO",{"$f":"VLOOKUP(Tabel3[[#This Row],[Warmtebron & type net]],'A. Breakdown'!$D$3:$G$64,4,FALSE)","v":"Een MT-warmtenet op basis van Oppervlaktewater aquathermie (TEO), inclusief WKO"},"Oppervlaktewater levert warmte via een centrale warmtepomp aan het warmtenet. Dit systeem werkt op MT-niveau (50-75°C), maakt gebruik van een centrale warmtepomp en levert warmte via vloerverwarming, lage temperatuur radiatoren of convectoren.","Aanwezigheid bron;\nVoldoende potentie;\nRuimte in de ondergrond voor WKO;\nRuimte op elektriciteitsnet\nVoldoende afzet","Minder geschikt voor nieuwbouw door goede initiele isolatie; Bij bestaande bouw afhankelijk van ligging, Ruimte voor WKO en netcapaciteit voor opwaardering bron.","Kansrijk bij middengrote dorpen (200 tot 500 weq)en stedelijke kernen; \nKansrijk bij rijgebouwen en appartementen;\nKansrijk bij goed geïsoleerde gebouwen","Warmtenet moet ontwikkeld worden, waarin de Gemeente een mogelijke rol kan spelen - dit betekent nadenken over investering en financiering; haalbaarheid en potentie moet onderzocht worden; techniek is innovatief en in pilotfase, dit zorgt voor langere ontwikkeltijd. Gemeente moet nadenken over tijdspad en planning; Gemeente moet afstemmen met waterschappen;\nGemeente is mogelijk bevoegd gezag vergunning WKO\naanwijzen warmtebedrijf","Warmtebedrijf/exploitant (kan Gemeente zijn):\n-\tInfrastructuur net/leidingen\n-\tOntwikkeling bron\n-\tCentrale warmtepompen en regeltechniek\n-\tOnderhoudskosten\nEindgebruiker (eventueel via Woningcorporatie/verhuurder):\n-\tAansluitkosten\n-\t(eventuele) Isolatiekosten om aangesloten te kunnen worden\n-Gebruikskosten/warmteafname\n-\tVaste maandelijkse lasten voor onderhoud\nLet op: Uiteindelijke kostenverdeling hangt af van keuzes en governance binnen het project en kunnen in wisselende mate bij de gebruiker of het warmtebedrijf liggen","Ruimte op het elektriciteitsnet; Ruimte ondergrond; potentie bron en systeem;\nrestricties waterwinningsgebied;\nRuimte ondergrond voor wko","Waterschappen\nmogelijk aangrenzende Gemeenten;\nbeleidsafdelingen Gemeente juridica en ondergrond","Vanaf energielabel D zijn aanvullende isolatiemaatregelen nodig. Gemeente kan dit stimuleren via collectieve inkoopacties en subsidies. LET OP: hoe hoger het energielabel/isolatie, hoe lager de elektriciteitskosten en hoe grotere energiebesparing","Kiezen voor deze warmteoplossing betekent een voorkeur uitspreken voor een collectief systeem met lage temperatuur, dat veel netcapaciteit vereist. De Gemeente moet afstemmen met netbeheerder en waterschappen. De oplossing is Kansrijk bij hoge warmtedichtheid en goed geïsoleerde gebouwen. Deze oplossing biedt mogelijkheid om in een keer meerdere gebouwen aardgasvrij te maken. Kosten kunnen collectief verdeeld worden om inclusiviteit te bevorderen."]
["Warmtenet","Verbranden van houtige biomassa​","Warmtenet - Verbranden van houtige biomassa​",{"$f":"VLOOKUP(Tabel3[[#This Row],[Warmtebron & type net]],'A. Breakdown'!$D$3:$G$64,4,FALSE)","v":"Een MT-warmtenet op basis van biomassa verbranding"},"Hout of snoeiafval wordt verbrand in een biomassaketel om warmte te leveren aan een gebouw of warmtenet.","biomassacentrale in de buurt; Voldoende afzet en dichtheid","Minder geschikt voor nieuwbouw door doorgaans te hoge isolatie;\nKansrijk bij bestaande bouw. ","\nKansrijk bij grote dorpen en stedelijke kernen (1500 tot 1500 weq weq);\n Kansrijk bij rijgebouwen en appartementen; \nKansrijk bij slecht te isoleren gebouwen","Warmtenet moet ontwikkeld worden, waarin de Gemeente een mogelijke rol kan spelen - dit betekent nadenken over investering en financiering; \nhaalbaarheid en potentie moet onderzocht worden;  \naanwijzen warmtebedrijf","Warmtebedrijf/exploitant (kan Gemeente zijn):\n-\tInfrastructuur net/leidingen\n-\tOntwikkeling bron\n-\tCentrale warmtepompen en regeltechniek\n-\tOnderhoudskosten\nEindgebruiker (eventueel via Woningcorporatie/verhuurder):\n-\tAansluitkosten\n-\t(eventuele) Isolatiekosten om aangesloten te kunnen worden\n-Gebruikskosten/warmteafname\n-\tVaste maandelijkse lasten voor onderhoud\nLet op: Uiteindelijke kostenverdeling hangt af van keuzes en governance binnen het project en kunnen in wisselende mate bij de gebruiker of het warmtebedrijf liggen","Natura2000 gebied; stickstofbeperkingen","Andere Gemeenten voor schaalvoordelen;","Geen beperkingen. LET OP: hoe hoger het energielabel/isolatie, hoe lager de elektriciteitskosten en hoe grotere energiebesparing","Kiezen voor deze oplossingrichting betekent de kans voor op relatief korte termijn collectieve warmte. Gebouwen hoeven niet nadrukkelijk tot een bepaald niveau geïsoleerd te worden, waardoor de warmteoplossing toegankelijk kan zijn voor grotere groepen inwoners. Deze warmteoplossing kan leiden tot een gelijktijdige transitie naar aardgasvrij. Materiaal om te verbranden is echter beperkt beschikbaar en complex om klimaatneutraal aan te leveren, waardoor deze warmteoplossing niet altijd als klimaatneutraal wordt gezien. Deze warmteoplossing kan als controversieel worden gezien. Kiezen voor deze warmteoplossing betekent daarnaast dat er gezoct moet worden naar een alternatief voor koeling"]
["Warmtenet","Vergisting/vergassing afval​","Warmtenet - Vergisting/vergassing afval​",{"$f":"VLOOKUP(Tabel3[[#This Row],[Warmtebron & type net]],'A. Breakdown'!$D$3:$G$64,4,FALSE)","v":"Een MT-warmtenet op basis van afval vergisting of vergassing"},"Afval wordt vergist of vergast, warmte wordt via het warmtenet geleverd. Dit systeem werkt op MT-niveau (40-75°C), maakt gebruik van radiatoren of convectoren.","beschikbaareid klimaatneutraal gas.","Af te raden bij nieuwbouw in verband met geen gasaansluiting in de gebouwen; Kansrijk bij (oude) bestaande bouw, indien beschikbaarheid bekend is.","\nKansrijk bij grote dorpen en stedelijke kernen (1500 tot 1500 weq weq);\n Kansrijk bij rijgebouwen en appartementen; \nKansrijk bij slecht te isoleren gebouwen","Warmtenet moet ontwikkeld worden, waarin de Gemeente een mogelijke rol kan spelen - dit betekent nadenken over investering en financiering; haalbaarheid en potentie moet onderzocht worden; techniek is innovatief en in pilotfase, dit zorgt voor langere ontwikkeltijd. Gemeente moet nadenken over tijdspad en planning; \naanwijzen warmtebedrijf\nEen Gemeente zelf kan slecht sturen waar vergisting kan, behalve via vergunningen; Gemeente kan deze bron niet gebruiken als duurzaam alternatief door de beperkte beschikbaarheid","Warmtebedrijf/exploitant (kan Gemeente zijn):\n-\tInfrastructuur net/leidingen\n-\tOntwikkeling bron\n-\tCentrale warmtepompen en regeltechniek\n-\tOnderhoudskosten\nEindgebruiker (eventueel via Woningcorporatie/verhuurder):\n-\tAansluitkosten\n-\t(eventuele) Isolatiekosten om aangesloten te kunnen worden\n-Gebruikskosten/warmteafname\n-\tVaste maandelijkse lasten voor onderhoud\nLet op: Uiteindelijke kostenverdeling hangt af van keuzes en governance binnen het project en kunnen in wisselende mate bij de gebruiker of het warmtebedrijf liggen","beschikbaarheid bron","Vergisters; rijksoverheid over beschikbaarheid; beleidsafdeling ondergrond;","Geen beperkingen. LET OP: hoe hoger het energielabel/isolatie, hoe lager de elektriciteitskosten en hoe grotere energiebesparing","Kiezen voor deze warmteoplossing betekent een voorkeur uitspreken voor een bewezen technologie dat afhankelijk is van externe broneigenaren. De Gemeente heeft beperkte sturingsmogelijkheden en moet duidelijke afspraken maken over levering en continuïteit. Deze oplossing biedt geen mogelijkheid tot koeling, hierover moet nagedacht worden. Rijk raadt oplossingsrichting tot op heden af ivm beperkte beschikbaarheid nu en in de toekomst"]
["Warmtenet","Zonthermische panelen","Warmtenet - Zonthermische panelen",{"$f":"VLOOKUP(Tabel3[[#This Row],[Warmtebron & type net]],'A. Breakdown'!$D$3:$G$64,4,FALSE)","v":"Een MT-warmtenet op basis van zonnecollectoren met een centrale warmtepomp"},"Zonthermische energie wordt centraal opgeslagen en via het warmtenet geleverd. Dit systeem werkt op MT-niveau (40-75°C), maakt gebruik van een centrale warmtepomp en levert warmte via radiatoren of convectoren.","Beschikbare Ruimte voor panelen; Ruimte ondergrond warmtenet; bufferopslag; back-up systeem","Toepasbaar bij zowel nieuwbouw als bestaande bouw; Bij bestaande bouw afhankelijk van Ruimte en isolatie.","Een te realiseren bron;\ntoepasbaar bij slecht isoleerbare gebouwen; \nKansrijk bij middelgrote (500 tot 1500 weq) kernen; \nKansrijk bij rijtjesgebouwen; \nontlast elektriciteitsnet","Warmtenet moet ontwikkeld worden, waarin de Gemeente een mogelijke rol kan spelen - dit betekent nadenken over investering en financiering; \nhaalbaarheid en potentie moet onderzocht worden;  \naanwijzen warmtebedrijf","Warmtebedrijf/exploitant (kan Gemeente zijn):\n-\tInfrastructuur net/leidingen\n-\tOntwikkeling bron\n-\tCentrale warmtepompen en regeltechniek\n-\tOnderhoudskosten\nEindgebruiker (eventueel via Woningcorporatie/verhuurder):\n-\tAansluitkosten\n-\t(eventuele) Isolatiekosten om aangesloten te kunnen worden\n-Gebruikskosten/warmteafname\n-\tVaste maandelijkse lasten voor onderhoud\nLet op: Uiteindelijke kostenverdeling hangt af van keuzes en governance binnen het project en kunnen in wisselende mate bij de gebruiker of het warmtebedrijf liggen","Bak-up voor piekvoorziening; Ruimte ondergrond; verdeling kosten","Uitvoerende bedrijven met ervaring; \nEigenaar grond;\nBeleidsafdeling ondergrond;\n","Vanaf energielabel C zijn aanvullende isolatiemaatregelen nodig. Gemeente kan dit stimuleren via collectieve inkoopacties en subsidies. LET OP: hoe hoger het energielabel/isolatie, hoe lager de elektriciteitskosten en hoe grotere energiebesparing","Kiezen voor deze warmteoplossing betekent een voorkeur uitspreken voor een collectief systeem, zonder mogelijkheid tot koeling. De oplossing is afhankelijk van zoninstraling en vereist opslag. Kansrijk als onderdeel van een energiemix, maar systeem is als een op zichzelf staand systeem nog niet toegepast en hierdoor kostbaar. Dit kan zorgen voor onzekerheid."]
["Warmtenet","Zonthermische panelen + HTO","Warmtenet - Zonthermische panelen + HTO",{"$f":"VLOOKUP(Tabel3[[#This Row],[Warmtebron & type net]],'A. Breakdown'!$D$3:$G$64,4,FALSE)","v":"Een MT-warmtenet op basis van zonnecollectoren, inclusief HTO (hoge temperatuursopslag)"},"De warmte uit de panelen wordt opgeslagen in hoge-temperatuur-opslag (HTO) voor gebruik op momenten van hoge vraag.","Ruimte voor collectoren; Ruimte voor HTO","Minder geschikt voor nieuwbouw door doorgaans te hoge isolatie;\nKansrijk bij bestaande bouw. ","Een te realiseren bron;\ntoepasbaar bij slecht isoleerbare gebouwen; \nKansrijk bij middelgrote (500 tot 1500 weq) kernen; \nKansrijk bij rijtjesgebouwen; \nontlast elektriciteitsnet","Warmtenet moet ontwikkeld worden, waarin de Gemeente een mogelijke rol kan spelen - dit betekent nadenken over investering en financiering; \nhaalbaarheid en potentie moet onderzocht worden;  \naanwijzen warmtebedrijf","Warmtebedrijf/exploitant (kan Gemeente zijn):\n-\tInfrastructuur net/leidingen\n-\tOntwikkeling bron\n-\tCentrale warmtepompen en regeltechniek\n-\tOnderhoudskosten\nEindgebruiker (eventueel via Woningcorporatie/verhuurder):\n-\tAansluitkosten\n-\t(eventuele) Isolatiekosten om aangesloten te kunnen worden\n-Gebruikskosten/warmteafname\n-\tVaste maandelijkse lasten voor onderhoud\nLet op: Uiteindelijke kostenverdeling hangt af van keuzes en governance binnen het project en kunnen in wisselende mate bij de gebruiker of het warmtebedrijf liggen","Potentie systeem;\n afzet;\nRuimtegebruik opwek en ruimte ondergrond","projectontwikkelaren;\nRES;\nNetbeheerder;\nBeleidsafdeling ruimtelijke ordening en ondergrond;\n","Geen beperkingen. LET OP: hoe hoger het energielabel/isolatie, hoe lager de elektriciteitskosten en hoe grotere energiebesparing","Kiezen voor deze warmteoplossing betekent een voorkeur uitspreken voor een collectieve oplossing die zonnewarmte opslaat voor gebruik op piekmomenten. Vereist opslag, Ruimte en goede afstemming. Kansrijk als onderdeel van een energiemix. Deze oplossing biedt wel mogelijkheid tot koeling."]

{"sheet":"E. GemeenteData","index":9,"n_rows":257,"n_cols":31,"rows_kept":257,"cut":false,"hidden":true,"merged":[]}
["Plaats","Gemeente","Aantal woningen (2025)","Gemiddelde energielabel (2025)","Meest voorkomende energielabel (2025)","Meest voorkomende energielabel % van totaal (2025)","Label A en beter","Label B","Label C","Label D","Label E","Label F","Label G","Geen label","Meest voorkomende bouwjaar (2025)","Meest voorkomende bouwjaar % van totaal (2025)","Voor 1930","1930 tot 1945","1946 tot 1965","1966 tot 1975","1976 tot 1992","1993 tot 1996","1997 tot 2000","2001 tot 2006","2007 tot 2011","2012 tot 2014","2015 tot 2020","Gemiddeld Aardgasverbruik totaal m3 (2022)","Gemiddelde gasvraag per km2 in m3","Netcongestie afname (Meest voorkomende status)","Score warmtevraagdichtheid"]
["Aalst (Gld.)","West Betuwe",924,"Label C","Label A en beter",0.21,191,50,72,51,19,35,33,473,"1976 tot 1992",0.25,141,36,118,104,230,52,46,23,90,17,67,1269,329897,"Gebied is in onderzoek met wachtrij","Middelhoog"]
["Achterdrempt","Bronckhorst",288,"Label D","Label C",0.11,14,30,32,6,5,8,14,179,"1976 tot 1992",0.3,74,27,35,39,85,15,4,3,5,0,1,1608,107709,"Transportcapaciteit beperkt beschikbaar zonder wachtrij","Middellaag"]
["Acquoy","West Betuwe",238,"Label D","Label C",0.16,12,10,37,10,6,8,7,148,"Voor 1930",0.28999999999999998,70,20,36,40,25,20,8,5,6,1,7,1343,134290,"Transportcapaciteit beperkt beschikbaar zonder wachtrij","Middellaag"]
["Aerdt","Zevenaar",327,"Label D","Label A en beter",0.14000000000000001,46,22,40,13,14,7,17,168,"Voor 1930",0.25,82,13,31,25,81,42,3,23,17,4,6,1463,136102,"Tekort aan transportcapaciteit met wachtrij","Middellaag"]
["Afferden (Gld.)","Druten",655,"Label C","Label A en beter",0.16,106,79,66,34,20,21,15,314,"1976 tot 1992",0.2,105,25,125,66,128,57,10,68,46,7,18,1286,276479,"Tekort aan transportcapaciteit met wachtrij","Middelhoog"]
["Alem","Maasdriel",256,"Label C","Label A en beter",0.15,38,18,33,5,3,6,7,146,"1976 tot 1992",0.27,12,2,69,27,70,26,3,22,4,13,8,1377,143253,"Transportcapaciteit beperkt beschikbaar zonder wachtrij","Middellaag"]
["Almen","Lochem",447,"Label D","Label C",0.14000000000000001,54,25,61,29,12,11,16,239,"1966 tot 1975",0.22,84,36,76,98,54,30,3,14,17,13,22,1513,187575,"Transportcapaciteit beperkt beschikbaar zonder wachtrij","Midden"]
["Alphen (Gld.)","West Maas en Waal",370,"Label D","Label C",0.19,38,29,70,24,17,14,17,161,"1966 tot 1975",0.3,26,17,69,112,110,16,3,8,7,0,2,1280,229120,"Gebied is in onderzoek met wachtrij","Midden"]
["Altforst","West Maas en Waal",217,"Label D","Label A en beter",0.12,27,11,13,12,6,7,8,133,"Voor 1930",0.2,44,4,37,42,35,7,11,24,3,1,9,1593,101975,"Tekort aan transportcapaciteit met wachtrij","Middellaag"]
["Ammerzoden","Maasdriel",1600,"Label C","Label A en beter",0.19,304,121,220,75,42,29,29,780,"1976 tot 1992",0.28999999999999998,50,27,326,307,471,80,64,72,22,39,142,1389,672125,"Tekort aan transportcapaciteit met wachtrij","Hoog"]
["Andelst/Herveld-Noord","Overbetuwe",1760,"Label C","Label A en beter",0.18,316,191,208,113,54,34,53,791,"1976 tot 1992",0.24,196,91,180,240,417,69,139,169,165,4,90,1189,557621,"Tekort aan transportcapaciteit met wachtrij","Hoog"]
["Angeren","Lingewaard",1138,"Label D","Label C",0.12,130,98,134,50,39,30,41,616,"1946 tot 1965",0.24,105,38,277,254,228,5,107,44,36,15,29,1299,418134,"Tekort aan transportcapaciteit met wachtrij","Middelhoog"]
["Appeltern","West Maas en Waal",343,"Label C","Label A en beter",0.15,50,42,31,12,6,7,13,182,"Voor 1930",0.21,72,14,38,68,71,21,9,29,5,10,6,1459,141511,"Tekort aan transportcapaciteit met wachtrij","Middellaag"]
["Asch","Buren",122,"Label D","Label B",0.15,6,18,11,7,5,4,7,64,"1976 tot 1992",0.26,29,2,17,22,32,4,4,6,3,2,1,1540,113960,"Gebied is in onderzoek met wachtrij","Middellaag"]
["Asperen","West Betuwe",1239,"Label D","Label C",0.16,172,131,199,84,30,49,47,527,"1976 tot 1992",0.24,227,88,144,244,294,36,51,24,63,1,67,1053,561420,"Tekort aan transportcapaciteit met wachtrij","Hoog"]
["Azewijn","Montferland",309,"Label C","Label A en beter",0.17,53,16,15,6,6,9,8,196,"1976 tot 1992",0.23,54,20,33,37,71,33,5,1,31,3,21,1488,125009,"Tekort aan transportcapaciteit met wachtrij","Middellaag"]
["Baak","Bronckhorst",446,"Label D","Label C",0.13,28,23,56,27,25,15,20,252,"Voor 1930",0.3,134,21,68,57,97,22,19,9,6,7,6,1513,142263,"Tekort aan transportcapaciteit met wachtrij","Middellaag"]
["Babberich","Zevenaar",791,"Label D","Label C",0.17,90,74,133,44,31,17,45,357,"1966 tot 1975",0.22,87,27,115,175,121,103,50,42,27,38,6,1117,271536,"Gebied is in onderzoek met wachtrij","Middelhoog"]
["Balgoy","Wijchen",227,"Label D","Label B",0.1,8,23,22,9,8,7,7,143,"1976 tot 1992",0.22,48,11,21,36,50,28,2,17,3,1,10,1480,118400,"Tekort aan transportcapaciteit met wachtrij","Middellaag"]
["Barchem","Lochem",738,"Label D","Label C",0.09,58,50,64,37,25,18,25,461,"Voor 1930",0.23,170,69,115,114,99,5,47,64,9,30,16,1561,240375,"Gebied is in onderzoek met wachtrij","Midden"]
["Batenburg","Wijchen",275,"Label D","Label A en beter",0.14000000000000001,38,20,29,11,6,8,8,155,"Voor 1930",0.31,85,7,44,32,54,17,16,15,2,2,1,1509,147899,"Tekort aan transportcapaciteit met wachtrij","Middellaag"]
["Beek (Gld. bij Didam)","Montferland",857,"Label D","Label C",0.12,97,49,102,38,26,23,19,503,"1976 tot 1992",0.23,68,62,194,107,199,79,30,16,8,41,53,1297,321773,"Tekort aan transportcapaciteit met wachtrij","Middelhoog"]
["Beekbergen","Apeldoorn",1574,"Label D","Label A en beter",0.13,209,189,187,79,33,50,60,767,"1966 tot 1975",0.24,183,177,160,379,349,114,12,20,34,63,83,1395,622127,"Gebied is in onderzoek met wachtrij","Hoog"]
["Beekbergen-Hulsthorstweg","Apeldoorn",378,"Label E","Label A en beter",0.08,31,16,27,28,3,21,31,221,"1930 tot 1945",0.28999999999999998,82,108,46,34,30,9,7,12,17,6,27,1793,100427,"Tekort aan transportcapaciteit met wachtrij","Middellaag"]
["Beesd","West Betuwe",1450,"Label D","Label C",0.15,136,166,218,61,37,30,33,769,"1976 tot 1992",0.32,174,66,150,297,462,78,125,27,12,2,57,1278,627506,"Gebied is in onderzoek met wachtrij","Hoog"]
["Bekkenkamp","Bronckhorst",206,"Label D","Label C",0.08,6,2,16,7,3,5,7,160,"Voor 1930",0.33,67,16,37,26,25,9,9,14,2,1,0,1970,57130,"Transportcapaciteit beperkt beschikbaar zonder wachtrij","Laag"]
["Beltrum","Berkelland",960,"Label D","Label A en beter",0.08,80,42,53,37,24,21,20,683,"1976 tot 1992",0.21,118,104,172,197,200,46,27,33,32,10,21,1364,297252,"Transportcapaciteit beperkt beschikbaar zonder wachtrij","Middelhoog"]
["Bennekom-De Kraats","Ede",264,"Label E","Label G",0.05,11,7,11,8,4,5,13,205,"Voor 1930",0.34,89,32,43,32,26,0,2,11,5,7,17,1720,86000,"Tekort aan transportcapaciteit met wachtrij","Laag"]
["Bennekom-'t Hazeleger","Ede",89,"N.V.T.","Label A en beter",0.01,1,0,0,0,0,0,1,87,"1966 tot 1975",0.9,0,0,1,80,4,0,0,2,1,0,1,1662,88087,"Tekort aan transportcapaciteit met wachtrij","Laag"]
["Berg en Dal (Gld.)","Berg en dal",537,"Label D","Label A en beter",0.22,118,22,37,35,51,41,13,220,"1966 tot 1975",0.31,69,34,106,165,34,12,29,12,13,56,7,1431,450870,"Gebied is in onderzoek met wachtrij","Middelhoog"]
["Bergharen","Wijchen",698,"Label C","Label A en beter",0.17,120,43,66,21,10,11,19,408,"1976 tot 1992",0.25,134,15,78,110,175,46,48,32,34,21,5,1413,290980,"Tekort aan transportcapaciteit met wachtrij","Middelhoog"]
["Beusichem","Buren",1391,"Label C","Label A en beter",0.18,257,136,176,65,28,10,24,695,"1976 tot 1992",0.28999999999999998,109,43,135,255,399,44,77,90,114,31,94,1256,512603,"Gebied is in onderzoek met wachtrij","Hoog"]
["Bontebrug","Oude Ijsselstreek",1815,"Label D","Label A en beter",0.14000000000000001,259,257,236,104,75,49,92,743,"1946 tot 1965",0.26,288,114,477,128,338,69,86,54,121,52,88,1117,586419,"Gebied is in onderzoek met wachtrij","Hoog"]
["Boven-Leeuwen","West Maas en Waal",912,"Label D","Label A en beter",0.19,172,52,121,55,25,23,44,420,"1976 tot 1992",0.19,160,48,125,161,173,50,54,20,19,76,26,1316,363187,"Gebied is in onderzoek met wachtrij","Middelhoog"]
["Braamt","Montferland",542,"Label D","Label A en beter",0.15,79,45,49,27,10,18,24,290,"1976 tot 1992",0.19,71,50,95,76,101,29,16,11,61,10,22,1411,266621,"Tekort aan transportcapaciteit met wachtrij","Middelhoog"]
["Brakel (Gld.)","Zaltbommel",1173,"Label D","Label A en beter",0.18,216,75,128,78,34,22,37,583,"1966 tot 1975",0.24,154,22,159,284,234,59,48,35,126,24,28,1257,457523,"Transportcapaciteit beperkt beschikbaar zonder wachtrij","Middelhoog"]
["Bredevoort","Aalten",853,"Label D","Label C",0.11,50,31,94,45,34,28,35,536,"Voor 1930",0.25,214,94,148,134,127,8,56,13,28,16,15,1219,287608,"Gebied is in onderzoek met wachtrij","Middelhoog"]
["Breedenbroek","Oude IJsselstreek",384,"Label E","Label A en beter",7.0000000000000007E-2,26,17,22,22,8,17,26,246,"Voor 1930",0.26,99,28,66,39,81,27,9,9,17,5,4,1484,237372,"Transportcapaciteit beperkt beschikbaar zonder wachtrij","Midden"]
["Breedeweg","Berg en Dal",1111,"Label C","Label A en beter",0.18,205,122,110,46,49,31,11,537,"1946 tot 1965",0.33,18,41,372,310,119,40,14,92,58,32,15,1246,569606,"Gebied is in onderzoek met wachtrij","Hoog"]
["Bronkhorst","Bronckhorst",172,"Label E","Label D",0.08,5,4,4,13,6,4,9,127,"Voor 1930",0.49,85,15,16,7,27,3,3,3,9,2,2,1670,113545,"Gebied is in onderzoek met wachtrij","Middellaag"]
["Bruchem","Zaltbommel",533,"Label C","Label A en beter",0.21,112,44,63,9,14,8,13,270,"1976 tot 1992",0.28999999999999998,47,18,55,106,152,45,14,39,11,28,18,1290,243810,"Tekort aan transportcapaciteit met wachtrij","Midden"]
["Buren-Noord (Gld.)","Buren",1132,"Label D","Label A en beter",0.18,202,67,161,69,39,21,11,562,"1976 tot 1992",0.27,115,19,177,256,306,29,11,14,159,13,33,1254,386229,"Gebied is in onderzoek met wachtrij","Middelhoog"]
["Buren-Zuid (Gld.)","Buren",525,"Label C","Label A en beter",0.26,138,24,61,33,13,8,3,245,"1966 tot 1975",0.35,16,7,38,186,91,1,3,10,155,12,6,1201,362731,"Tekort aan transportcapaciteit met wachtrij","Middelhoog"]
["Bussloo","Voorst",78,"Label E","Label A en beter",0.08,6,2,2,5,2,1,6,54,"Voor 1930",0.44,34,11,6,8,5,3,4,4,1,0,2,1791,48370,"Gebied is in onderzoek met wachtrij","Laag"]
["Buurmalsen (Gld. bij Geldermalsen)","West Betuwe",399,"Label D","Label B",0.12,33,48,35,17,14,19,20,213,"Voor 1930",0.3,119,35,55,100,71,2,1,11,2,0,3,1486,638925,"Tekort aan transportcapaciteit met wachtrij","Hoog"]
["De Glind","Barneveld",206,"Label D","Label A en beter",0.16,33,7,29,21,12,3,7,94,"1946 tot 1965",0.21,17,25,44,23,31,1,9,22,13,4,17,1670,95212,"Gebied is in onderzoek met wachtrij","Laag"]
["De Haere","Bronckhorst",600,"Label E","Label A en beter",7.0000000000000007E-2,41,18,34,36,17,23,37,394,"Voor 1930",0.38,229,143,41,19,41,11,12,38,37,8,21,1795,136412,"Transportcapaciteit beperkt beschikbaar zonder wachtrij","Middellaag"]
["De Heurne","Aalten",394,"Label D","Label A en beter",0.06,25,22,16,9,11,16,24,271,"Voor 1930",0.42,164,39,52,29,43,5,25,7,5,4,21,1496,112204,"Tekort aan transportcapaciteit met wachtrij","Middellaag"]
["De Horst (Gld.)","Montferland",455,"Label D","Label C",0.11,46,30,51,16,23,19,13,257,"1946 tot 1965",0.47,6,9,216,34,80,49,23,11,0,13,14,1307,173847,"Gebied is in onderzoek met wachtrij","Midden"]
["De Steeg","Rheden",499,"Label E","Label C",0.1,25,21,50,32,20,17,42,292,"Voor 1930",0.41,204,45,71,106,52,3,4,8,2,2,2,1461,245420,"Gebied is in onderzoek met wachtrij","Midden"]
["De Vossenberg","Apeldoorn",358,"Label E","Label C",0.08,27,14,28,16,12,19,26,216,"1946 tot 1965",0.21,65,65,74,43,48,8,5,19,7,10,14,1740,379320,"Transportcapaciteit beperkt beschikbaar zonder wachtrij","Middelhoog"]
["Deest","Druten",817,"Label C","Label A en beter",0.28999999999999998,240,33,100,52,28,13,19,332,"1946 tot 1965",0.27,66,54,220,173,125,42,17,5,41,36,38,1143,298303,"Tekort aan transportcapaciteit met wachtrij","Middelhoog"]
["Deil","West Betuwe",844,"Label C","Label B",0.18,66,151,86,33,22,22,29,435,"1976 tot 1992",0.23,158,46,103,107,197,111,91,12,6,3,10,1414,380406,"Gebied is in onderzoek met wachtrij","Middelhoog"]
["Delwijnen","Zaltbommel",176,"Label D","Label C",0.06,10,8,11,7,8,4,9,119,"1976 tot 1992",0.24,34,14,22,22,43,1,4,11,3,0,22,1565,78239,"Tekort aan transportcapaciteit met wachtrij","Laag"]
["Dodewaard","Neder-Betuwe",1654,"Label D","Label C",0.15,159,147,242,36,47,29,50,944,"1976 tot 1992",0.22,163,72,349,318,364,107,131,42,57,32,19,1289,598294,"Gebied is in onderzoek met wachtrij","Hoog"]
["Doornenburg","Lingewaard",1142,"Label D","Label A en beter",0.12,139,99,129,50,38,29,28,630,"1946 tot 1965",0.25,113,69,291,252,233,59,46,31,31,2,15,1323,440455,"Tekort aan transportcapaciteit met wachtrij","Middelhoog"]
["Doornspijk","Elburg",1503,"Label C","Label A en beter",0.15,230,62,100,61,40,31,50,929,"1946 tot 1965",0.21,198,105,317,167,278,43,54,107,92,16,126,1374,344912,"Tekort aan transportcapaciteit met wachtrij","Middelhoog"]
["Drempt","Bronckhorst",577,"Label D","Label A en beter",0.15,84,31,51,19,14,17,16,345,"1966 tot 1975",0.27,119,47,62,155,127,29,27,6,4,0,1,1454,228286,"Transportcapaciteit beperkt beschikbaar zonder wachtrij","Midden"]
["Dreumel","West Maas en Waal",1186,"Label C","Label A en beter",0.18,210,110,132,59,29,33,46,567,"1966 tot 1975",0.24,148,96,137,279,193,31,117,9,55,67,54,1240,486080,"Gebied is in onderzoek met wachtrij","Middelhoog"]
["Echteld","Neder-Betuwe",220,"Label D","Label C",0.18,10,34,40,14,9,5,4,104,"1946 tot 1965",0.28000000000000003,17,3,62,59,59,14,3,1,1,1,0,1320,135960,"Gebied is in onderzoek met wachtrij","Middellaag"]
["Eck en Wiel","Buren",660,"Label D","Label C",0.1,33,63,65,31,22,16,25,405,"1966 tot 1975",0.19,114,61,78,128,109,86,15,29,25,2,13,1468,275891,"Tekort aan transportcapaciteit met wachtrij","Middelhoog"]
["Ede - Noord","Ede",499,"Label D","Label A en beter",0.08,40,16,16,15,7,8,17,380,"1993 tot 1996",0.41,38,34,49,54,47,205,8,30,19,2,13,1860,243660,"Transportcapaciteit beperkt beschikbaar zonder wachtrij","Midden"]
["Ede-Oost","Ede",1562,"Label B","Label A en beter",0.5,778,27,32,24,12,14,26,649,"2015 tot 2020",0.44,103,54,97,85,76,208,18,42,39,160,680,864,145173,"Tekort aan transportcapaciteit met wachtrij","Middellaag"]
["Ederveen","Ede",1185,"Label C","Label A en beter",0.19,223,79,89,49,26,25,36,658,"1976 tot 1992",0.2,151,116,132,139,241,61,37,28,162,17,101,1396,422854,"Tekort aan transportcapaciteit met wachtrij","Middelhoog"]
["Eefde","Lochem",2636,"Label D","Label C",0.16,293,190,429,210,96,84,87,1247,"1946 tot 1965",0.22,377,317,576,486,318,63,116,90,95,165,33,1240,560288,"Gebied is in onderzoek met wachtrij","Hoog"]
["Ellecom","Rheden",494,"Label D","Label C",0.09,42,30,46,21,12,15,14,314,"Voor 1930",0.42,207,23,46,45,76,40,5,26,11,0,15,1604,245442,"Transportcapaciteit beperkt beschikbaar zonder wachtrij","Midden"]
["Elspeet","Nunspeet",1547,"Label C","Label A en beter",0.18,274,134,148,54,31,27,43,836,"1976 tot 1992",0.24,88,96,182,228,365,64,75,132,79,98,140,1379,555829,"Transportcapaciteit beperkt beschikbaar zonder wachtrij","Hoog"]
["Empe","Brummen",226,"Label D","Label A en beter",0.11,25,11,15,8,8,9,15,135,"Voor 1930",0.43,97,28,24,12,30,5,7,12,5,1,5,1603,109023,"Transportcapaciteit beperkt beschikbaar zonder wachtrij","Middellaag"]
["Emst","Epe",580,"Label C","Label A en beter",0.26,149,68,45,24,13,17,17,247,"1946 tot 1965",0.21,46,29,119,115,72,40,56,2,60,22,19,1210,245630,"Tekort aan transportcapaciteit met wachtrij","Midden"]
["Enspijk","West Betuwe",231,"Label D","Label C",0.13,23,15,29,11,15,5,13,120,"1966 tot 1975",0.28999999999999998,42,14,37,67,53,7,2,3,1,2,3,1429,171502,"Gebied is in onderzoek met wachtrij","Midden"]
["Epe-De Epenhorst","Epe",770,"Label E","Label G",0.08,55,25,58,37,27,33,63,472,"Voor 1930",0.25,191,149,119,67,97,13,50,30,19,8,27,1855,432113,"Tekort aan transportcapaciteit met wachtrij","Middelhoog"]
["Epse","Lochem",887,"Label D","Label A en beter",0.18,164,42,126,51,38,36,28,402,"1966 tot 1975",0.27,67,75,178,238,111,34,9,40,45,7,83,1686,399471,"Gebied is in onderzoek met wachtrij","Middelhoog"]
["Erichem","Buren",200,"Label D","Label C",0.09,13,7,17,15,4,4,14,126,"Voor 1930",0.32,63,16,41,27,28,2,5,13,1,3,1,1655,196993,"Tekort aan transportcapaciteit met wachtrij","Midden"]
["Ermelo-Bos en Weide","Ermelo",518,"Label E","Label A en beter",0.04,19,3,14,15,8,7,12,440,"1976 tot 1992",0.19,48,39,88,85,100,24,53,37,9,8,27,1530,693090,"Gebied is in onderzoek met wachtrij","Hoog"]
["Ermelo-de Horsterhoeve","Ermelo",272,"Label B","Label A en beter",0.4,108,3,10,3,4,5,1,138,"2007 tot 2011",0.59,21,13,24,11,11,6,10,2,160,3,11,1220,431880,"Tekort aan transportcapaciteit met wachtrij","Middelhoog"]
["Ermelo-Hooge Geest","Ermelo",272,"Label B","Label A en beter",0.4,108,3,10,3,4,5,1,138,"2007 tot 2011",0.59,21,13,24,11,11,6,10,2,160,3,11,1220,563640,"Tekort aan transportcapaciteit met wachtrij","Hoog"]
["Ermelo-Horst","Ermelo",1544,"Label C","Label A en beter",0.11,174,23,53,32,22,31,39,1170,"1976 tot 1992",0.17,166,172,205,141,255,50,79,91,210,34,141,1453,920006,"Gebied is in onderzoek met wachtrij","Hoog"]
["Est","West Betuwe",212,"Label D","Label C",0.12,23,17,25,12,8,5,10,112,"1976 tot 1992",0.22,31,12,27,21,47,29,15,17,7,3,3,1540,110847,"Tekort aan transportcapaciteit met wachtrij","Middellaag"]
["Etten (Gld.)","Oude IJsselstreek",772,"Label D","Label C",0.14000000000000001,56,66,105,30,25,28,34,428,"1966 tot 1975",0.21,129,53,124,160,155,66,24,13,25,16,7,1350,454915,"Gebied is in onderzoek met wachtrij","Middelhoog"]
["Exel","Lochem",149,"Label D","Label C",7.0000000000000007E-2,8,5,10,7,4,3,3,109,"1976 tot 1992",0.2,29,22,15,16,30,4,6,4,12,3,8,1673,53527,"Transportcapaciteit beperkt beschikbaar zonder wachtrij","Laag"]
["Gameren","Zaltbommel",1093,"Label C","Label A en beter",0.22,243,63,87,36,17,21,32,594,"1976 tot 1992",0.16,144,52,81,166,176,38,53,40,170,61,112,1216,359872,"Transportcapaciteit beperkt beschikbaar zonder wachtrij","Middelhoog"]
["Garderen","Barneveld",872,"Label D","Label A en beter",0.11,92,46,64,33,21,28,27,561,"1946 tot 1965",0.25,60,75,214,107,153,31,68,21,47,66,30,1505,434826,"Transportcapaciteit beperkt beschikbaar zonder wachtrij","Middelhoog"]
["Geesteren (Gld.)","Berkelland",522,"Label D","Label C",0.08,30,25,41,29,19,14,17,347,"Voor 1930",0.23,119,38,75,44,114,22,30,39,17,12,12,1630,167849,"Transportcapaciteit beperkt beschikbaar zonder wachtrij","Midden"]
["Gellicum","West Betuwe",133,"Label E","Label C",0.08,7,10,11,10,6,7,9,73,"Voor 1930",0.36,48,9,12,21,24,9,0,0,3,4,3,1614,235709,"Gebied is in onderzoek met wachtrij","Midden"]
["Gelselaar","Berkelland",269,"Label D","Label C",7.0000000000000007E-2,11,12,20,13,1,9,16,187,"Voor 1930",0.28000000000000003,76,14,23,45,52,11,24,10,4,4,6,1564,92259,"Gebied is in onderzoek met wachtrij","Laag"]
["Gendt-Hagevoort","Lingewaard",674,"Label E","Label A en beter",0.05,37,15,37,35,26,27,37,460,"1946 tot 1965",0.31,173,81,210,33,75,16,22,26,18,8,12,1677,239782,"Tekort aan transportcapaciteit met wachtrij","Midden"]
["Giesbeek","Zevenaar",1294,"Label C","Label A en beter",0.17,221,110,140,54,36,32,16,685,"1966 tot 1975",0.24,113,76,112,316,290,87,106,73,56,47,18,1192,425511,"Gebied is in onderzoek met wachtrij","Middelhoog"]
["Giesbeek-Riverparc","Zevenaar",352,"Label C","Label B",0.28000000000000003,49,99,16,0,0,0,0,188,"1997 tot 2000",0.9,0,0,0,0,1,28,318,0,0,0,5,1060,182320,"Gebied is in onderzoek met wachtrij","Midden"]
["Gorssel-Oost","Lochem",1701,"Label D","Label A en beter",0.17,287,160,285,89,61,54,50,715,"1946 tot 1965",0.25,124,122,417,293,256,76,6,122,94,84,107,1360,371280,"Transportcapaciteit beschikbaar zonder wachtrij","Middelhoog"]
["Groenlo-Zwolle","Oost Gelre",362,"Label E","Label C",7.0000000000000007E-2,18,4,24,9,10,15,20,262,"Voor 1930",0.28000000000000003,100,53,58,39,61,2,8,10,12,6,13,1664,36618,"Transportcapaciteit beperkt beschikbaar zonder wachtrij","Laag"]
["Groesbeek-Dekkerswald","Berg en Dal",134,"Label B","Label A en beter",0.38,51,1,0,0,0,1,1,80,"2012 tot 2014",0.92,2,2,1,5,1,0,0,0,0,123,0,130,6240,"Gebied is in onderzoek met wachtrij","Laag"]
["Groessen","Zevenaar",766,"Label D","Label A en beter",0.09,67,39,65,32,24,23,20,496,"1946 tot 1965",0.2,97,61,154,87,131,35,45,89,41,4,22,1410,444150,"Gebied is in onderzoek met wachtrij","Middelhoog"]
["Haaften","West Betuwe",1388,"Label B","Label A en beter",0.43,590,65,99,34,26,29,26,519,"1966 tot 1975",0.23,109,47,185,323,194,64,78,25,82,78,203,1123,413319,"Tekort aan transportcapaciteit met wachtrij","Middelhoog"]
["Haarlo","Berkelland",306,"Label D","Label A en beter",0.15,45,9,22,14,8,2,15,191,"Voor 1930",0.18,56,22,42,50,54,15,18,34,3,2,10,1433,108891,"Transportcapaciteit beperkt beschikbaar zonder wachtrij","Middellaag"]
["Hall","Brummen",242,"Label D","Label C",0.12,18,4,28,6,7,13,11,155,"Voor 1930",0.26,64,41,38,18,46,3,4,8,7,7,6,1600,104024,"Gebied is in onderzoek met wachtrij","Middellaag"]
["Halle","Bronckhorst",895,"Label D","Label C",7.0000000000000007E-2,50,42,62,38,18,20,57,608,"Voor 1930",0.23,206,167,135,114,136,33,14,20,56,7,7,1502,190704,"Gebied is in onderzoek met wachtrij","Midden"]
["Harderwijk-Zuid","Harderwijk",306,"Label D","Label A en beter",0.01,3,1,3,3,1,0,1,294,"1997 tot 2000",0.62,1,12,9,2,89,2,190,0,0,1,0,1237,1072462,"Gebied is in onderzoek met wachtrij","Hoog"]
["Harfsen","Lochem",756,"Label D","Label A en beter",0.14000000000000001,104,39,78,34,25,23,17,436,"1946 tot 1965",0.22,144,55,168,62,130,44,18,13,41,13,68,1486,249663,"Tekort aan transportcapaciteit met wachtrij","Midden"]
["Harreveld","Oost Gelre",509,"Label D","Label C",0.09,33,16,48,17,14,19,18,344,"1976 tot 1992",0.25,93,29,111,58,125,24,15,9,23,10,12,1378,181958,"Gebied is in onderzoek met wachtrij","Midden"]
["Harskamp","Ede",1181,"Label D","Label A en beter",0.11,135,90,128,37,26,17,39,709,"1946 tot 1965",0.24,139,100,286,119,269,55,46,44,49,3,71,1395,382286,"Tekort aan transportcapaciteit met wachtrij","Middelhoog"]
["Hattemerbroek","Oldebroek",435,"Label D","Label A en beter",0.19,84,30,45,27,22,14,16,197,"1946 tot 1965",0.33,33,44,145,55,92,2,21,12,3,0,28,1280,364800,"Tekort aan transportcapaciteit met wachtrij","Middelhoog"]
["Heerde-Bakhuisbos","Heerde",488,"Label D","Label A en beter",0.08,38,18,36,26,20,10,28,312,"1946 tot 1965",0.18,83,79,86,53,59,12,21,41,14,22,18,1720,204680,"Gebied is in onderzoek met wachtrij","Midden"]
["Heerewaarden","Maasdriel",471,"Label D","Label A en beter",0.2,95,32,63,27,13,14,20,207,"1976 tot 1992",0.24,97,23,62,58,112,41,21,6,0,2,49,1252,241698,"Tekort aan transportcapaciteit met wachtrij","Midden"]
["Heerewaarden-Noord","Maasdriel",77,"Label D","Label D",0.12,5,5,8,9,2,2,2,44,"Voor 1930",0.34,26,8,22,4,6,4,3,1,2,0,1,1600,120000,"Tekort aan transportcapaciteit met wachtrij","Middellaag"]
["Hellouw","West Betuwe",384,"Label B","Label A en beter",0.3,117,21,22,9,10,6,13,186,"1976 tot 1992",0.22,77,3,79,45,84,19,5,7,50,6,9,1274,136303,"Transportcapaciteit beperkt beschikbaar zonder wachtrij","Middellaag"]
["Hernen","Wijchen",436,"Label B","Label A en beter",0.21,91,20,19,17,8,8,7,266,"1966 tot 1975",0.22,83,15,40,98,69,29,10,0,36,2,54,1417,178564,"Tekort aan transportcapaciteit met wachtrij","Midden"]
["Herveld-Zuid","Overbetuwe",325,"Label E","Label C",0.11,21,10,35,22,16,12,24,185,"Voor 1930",0.26,86,45,69,55,40,4,6,7,4,2,7,1323,290953,"Tekort aan transportcapaciteit met wachtrij","Middelhoog"]
["Herwen","Zevenaar",503,"Label D","Label B",0.13,29,67,45,54,24,14,14,256,"1976 tot 1992",0.24,90,23,90,94,120,18,30,8,18,6,6,1348,186080,"Tekort aan transportcapaciteit met wachtrij","Midden"]
["Herwijnen","West Betuwe",973,"Label D","Label C",0.17,110,120,167,51,13,11,21,480,"1976 tot 1992",0.27,154,25,124,195,267,47,21,42,26,55,17,1210,364210,"Transportcapaciteit beperkt beschikbaar zonder wachtrij","Middelhoog"]
["Herwijnen-Buitenburg","West Betuwe",973,"Label D","Label C",0.17,110,120,167,51,13,11,21,480,"1976 tot 1992",0.27,154,25,124,195,267,47,21,42,26,55,17,1210,84700,"Transportcapaciteit beperkt beschikbaar zonder wachtrij","Laag"]
["Heukelum","West Betuwe",966,"Label C","Label A en beter",0.22,211,109,130,54,13,23,27,399,"1966 tot 1975",0.24,136,65,89,231,196,45,33,23,24,51,73,1027,337861,"Tekort aan transportcapaciteit met wachtrij","Middelhoog"]
["Heumen","Heumen",610,"Label B","Label A en beter",0.33,202,51,62,18,10,11,4,252,"1976 tot 1992",0.17,41,11,93,96,101,40,55,8,90,2,73,1140,298804,"Gebied is in onderzoek met wachtrij","Middelhoog"]
["Heveadorp","Renkum",349,"Label D","Label C",0.16,35,30,55,22,14,6,1,186,"1976 tot 1992",0.54,73,8,54,4,187,4,15,0,1,1,2,1329,485179,"Gebied is in onderzoek met wachtrij","Middelhoog"]
["Hierden-De Biest","Harderwijk",632,"Label D","Label A en beter",0.05,32,23,30,12,7,12,16,500,"1976 tot 1992",0.22,54,47,125,58,141,34,51,78,17,7,20,1644,333793,"Tekort aan transportcapaciteit met wachtrij","Middelhoog"]
["Hierden-Kern","Harderwijk",937,"Label C","Label A en beter",0.15,141,72,91,23,12,17,39,542,"1976 tot 1992",0.18,114,70,135,151,169,61,27,55,34,43,78,1580,391827,"Tekort aan transportcapaciteit met wachtrij","Middelhoog"]
["Hoenderloo (Gld. Veluwe)","Apeldoorn",646,"Label D","Label A en beter",0.13,85,38,82,38,28,30,38,307,"Voor 1930",0.19,123,98,111,93,77,32,15,22,23,14,38,1631,230003,"Tekort aan transportcapaciteit met wachtrij","Midden"]
["Hoge Enk","Elburg",313,"Label D","Label A en beter",0.08,26,10,18,18,6,5,16,214,"1946 tot 1965",0.19,50,31,60,38,54,14,6,26,5,6,23,1390,140390,"Tekort aan transportcapaciteit met wachtrij","Middellaag"]
["Holkerveen","Nijkerk",927,"Label C","Label A en beter",0.28000000000000003,260,59,160,34,22,21,26,345,"2015 tot 2020",0.23,49,75,188,98,190,7,23,35,31,21,210,1182,487026,"Gebied is in onderzoek met wachtrij","Middelhoog"]
["Hoog Soeren","Apeldoorn",135,"Label D","Label C",0.1,9,9,13,5,4,5,6,84,"Voor 1930",0.42,57,19,11,6,17,6,11,1,4,0,3,1911,78343,"Gebied is in onderzoek met wachtrij","Laag"]
["Hoog-Keppel","Bronckhorst",286,"Label D","Label A en beter",0.1,30,15,27,22,11,10,8,163,"1966 tot 1975",0.27,72,16,59,78,19,3,3,28,5,1,2,1706,136488,"Transportcapaciteit beperkt beschikbaar zonder wachtrij","Middellaag"]
["Horssen","Druten",604,"Label C","Label A en beter",0.17,102,46,43,18,13,12,26,344,"1976 tot 1992",0.22,110,28,57,102,134,52,5,58,48,5,5,1476,262748,"Tekort aan transportcapaciteit met wachtrij","Middelhoog"]
["Hoven","Zutphen",1099,"Label D","Label A en beter",0.18,194,93,132,47,45,49,43,496,"Voor 1930",0.26,291,102,132,151,113,76,2,146,79,4,3,1114,802262,"Tekort aan transportcapaciteit met wachtrij","Hoog"]
["Huissen-Pannenhuis","Lingewaard",688,"Label E","Label A en beter",0.06,42,25,35,24,29,31,35,467,"1946 tot 1965",0.26,135,77,181,102,101,10,17,26,15,3,21,1743,212676,"Tekort aan transportcapaciteit met wachtrij","Midden"]
["Hulshorst","Nunspeet",487,"Label C","Label A en beter",0.18,90,30,44,19,6,9,7,282,"1976 tot 1992",0.21,45,64,59,27,102,28,37,42,10,33,40,1418,235471,"Tekort aan transportcapaciteit met wachtrij","Midden"]
["Hummelo","Bronckhorst",632,"Label D","Label C",0.23,22,70,145,25,12,9,13,336,"1976 tot 1992",0.46,103,35,35,87,292,30,27,6,7,0,10,1371,271534,"Transportcapaciteit beperkt beschikbaar zonder wachtrij","Middelhoog"]
["Hurwenen","Maasdriel",479,"Label D","Label A en beter",0.1,48,28,40,17,13,18,21,294,"1946 tot 1965",0.2,70,42,97,76,90,7,27,7,40,3,20,1363,155347,"Transportcapaciteit beperkt beschikbaar zonder wachtrij","Midden"]
["IJzendoorn","Neder-Betuwe",322,"Label D","Label A en beter",0.15,49,27,42,19,7,10,10,158,"1976 tot 1992",0.32,30,14,57,40,102,31,0,1,1,1,45,1160,150800,"Tekort aan transportcapaciteit met wachtrij","Midden"]
["IJzerlo","Aalten",232,"Label E","Label C",0.08,9,5,18,5,8,9,14,164,"Voor 1930",0.39,91,30,22,21,38,9,8,2,3,2,6,1554,57503,"Tekort aan transportcapaciteit met wachtrij","Laag"]
["Indoornik","Oude IJsselstreek",167,"Label E","Label E",0.08,7,4,13,8,14,6,6,109,"1946 tot 1965",0.28000000000000003,37,26,47,13,27,4,1,3,3,2,4,1647,242111,"Gebied is in onderzoek met wachtrij","Midden"]
["Ingen","Buren",748,"Label D","Label C",0.11,67,30,84,48,12,19,30,458,"1966 tot 1975",0.19,124,49,99,139,137,64,22,31,28,6,49,1436,282921,"Tekort aan transportcapaciteit met wachtrij","Middelhoog"]
["Kapel-Avezaath","Buren",201,"Label D","Label A en beter",0.13,26,13,8,11,9,9,13,112,"1946 tot 1965",0.33,34,12,66,15,27,19,2,2,15,1,8,1390,198770,"Gebied is in onderzoek met wachtrij","Midden"]
["Keijenborg","Bronckhorst",710,"Label D","Label C",0.09,52,34,62,32,12,28,32,458,"1966 tot 1975",0.25,133,38,126,174,138,23,20,24,19,7,8,1394,281532,"Tekort aan transportcapaciteit met wachtrij","Middelhoog"]
["Kekerdom","Berg en Dal",241,"Label C","Label A en beter",0.17,40,14,23,8,8,4,5,139,"1946 tot 1965",0.2,47,24,48,39,45,1,17,0,2,8,10,1207,91744,"Tekort aan transportcapaciteit met wachtrij","Laag"]
["Kerk-Avezaath","Buren",574,"Label D","Label C",0.16,53,57,94,25,20,13,13,299,"1976 tot 1992",0.39,77,24,54,95,223,58,20,13,7,0,3,1498,277048,"Gebied is in onderzoek met wachtrij","Middelhoog"]
["Kerkwijk","Zaltbommel",367,"Label C","Label A en beter",0.17,61,22,21,19,14,10,11,209,"1966 tot 1975",0.17,52,15,57,63,47,21,11,19,29,33,20,1519,141225,"Tekort aan transportcapaciteit met wachtrij","Middellaag"]
["Kerkwijk-West","Zaltbommel",164,"Label C","Label A en beter",0.2,32,15,13,7,3,3,3,88,"2012 tot 2014",0.18,26,2,23,27,23,16,1,3,8,29,6,1350,105300,"Tekort aan transportcapaciteit met wachtrij","Middellaag"]
["Kievitsdel","Apeldoorn",318,"Label E","Label C",0.08,17,13,25,20,16,22,16,189,"1946 tot 1965",0.24,22,27,75,74,36,2,3,2,0,5,72,2190,751235,"Gebied is in onderzoek met wachtrij","Hoog"]
["Kilder","Montferland",604,"Label C","Label B",0.09,51,54,38,17,13,18,16,397,"1946 tot 1965",0.24,51,43,142,99,104,32,57,17,10,20,29,1378,235606,"Tekort aan transportcapaciteit met wachtrij","Midden"]
["Klarenbeek (Gld. bij Apeldoorn)","Apeldoorn",915,"Label C","Label A en beter",0.15,136,81,63,41,22,24,32,516,"Voor 1930",0.21,194,72,107,81,141,75,30,41,49,20,105,1354,277585,"Gebied is in onderzoek met wachtrij","Middelhoog"]
["Kootwijkerbroek","Barneveld",1747,"Label C","Label A en beter",0.13,221,88,129,52,33,29,62,1133,"1976 tot 1992",0.18,158,144,258,206,315,109,52,96,176,57,176,1512,485448,"Gebied is in onderzoek met wachtrij","Middelhoog"]
["Kootwijkerbroek-Noord","Barneveld",1603,"Label D","Label A en beter",0.09,146,85,128,51,33,29,62,1069,"1976 tot 1992",0.2,157,140,255,206,314,106,52,94,118,22,139,1548,125348,"Gebied is in onderzoek met wachtrij","Middellaag"]
["Koudhoorn","Barneveld",114,"Label D","Label A en beter",0.08,9,8,8,5,1,3,8,72,"1946 tot 1965",0.19,17,15,22,19,16,4,6,6,6,1,2,1700,164900,"Transportcapaciteit beschikbaar zonder wachtrij","Midden"]
["Kranenburg","Bronckhorst",415,"Label E","Label G",7.0000000000000007E-2,12,12,18,19,8,12,28,306,"Voor 1930",0.42,175,46,39,45,55,9,13,8,9,5,11,1700,86693,"Transportcapaciteit beperkt beschikbaar zonder wachtrij","Laag"]
["Laag-Keppel","Bronckhorst",482,"Label E","Label B",7.0000000000000007E-2,21,32,22,22,13,19,26,327,"Voor 1930",0.45,216,33,92,22,28,7,50,9,16,3,6,1816,217897,"Transportcapaciteit beperkt beschikbaar zonder wachtrij","Midden"]
["Laag-Soeren","Rheden",446,"Label D","Label A en beter",0.22,99,27,44,51,17,11,12,185,"1966 tot 1975",0.26,93,20,80,115,32,0,5,4,22,3,72,1328,213742,"Transportcapaciteit beperkt beschikbaar zonder wachtrij","Midden"]
["Laag-Soeren - Zuid","Rheden",661,"Label C","Label A en beter",0.28000000000000003,185,32,53,55,18,24,21,273,"Voor 1930",0.19,127,59,87,116,49,3,4,11,35,94,76,1177,167177,"Transportcapaciteit beperkt beschikbaar zonder wachtrij","Midden"]
["Langerak","Lingewaard",164,"Label D","Label A en beter",0.09,14,5,5,7,3,4,9,117,"1930 tot 1945",0.28999999999999998,40,47,20,12,8,6,5,3,14,2,7,1507,67836,"Tekort aan transportcapaciteit met wachtrij","Laag"]
["Laren (Gld.)","Lochem",1133,"Label D","Label A en beter",0.17,189,63,120,53,24,32,27,625,"1976 tot 1992",0.21,152,65,144,100,238,12,86,55,120,9,152,1381,433560,"Gebied is in onderzoek met wachtrij","Middelhoog"]
["Lathum","Zevenaar",230,"Label D","Label C",0.13,23,15,31,14,3,6,8,130,"Voor 1930",0.22,51,6,29,35,51,24,8,4,16,2,4,1383,110658,"Tekort aan transportcapaciteit met wachtrij","Middellaag"]
["Lent Zuid","Nijmegen",null,"N.V.T.",{"$error":"#N/A"},{"$error":"#DIV/0!"},null,null,null,null,null,null,null,null,{"$error":"#N/A"},{"$error":"#DIV/0!"},null,null,null,null,null,null,null,null,null,null,null,380,461320,"Tekort aan transportcapaciteit met wachtrij","Middelhoog"]
["Leuth","Berg en Dal",null,"Label C","Label A en beter",0.19,147,91,135,19,15,14,6,350,"1976 tot 1992",0.37,22,37,149,125,286,35,4,73,2,2,42,1097,268755,"Tekort aan transportcapaciteit met wachtrij","Middelhoog"]
["Leuvenheim","Brummen",null,"Label E","Label C",0.1,22,5,27,15,12,16,16,156,"Voor 1930",0.38,101,36,48,42,17,3,1,1,1,0,19,1362,129411,"Transportcapaciteit beperkt beschikbaar zonder wachtrij","Middellaag"]
["Lieren","Apeldoorn",null,"Label D","Label C",0.08,39,35,42,19,12,17,35,336,"Voor 1930",0.3,162,88,50,91,62,21,12,8,27,3,11,1593,250036,"Gebied is in onderzoek met wachtrij","Middelhoog"]
["Lievelde","Oost Gelre",null,"Label D","Label A en beter",0.1,55,27,42,9,15,17,19,353,"1976 tot 1992",0.24,71,46,112,76,128,43,15,15,8,3,20,1415,198031,"Gebied is in onderzoek met wachtrij","Midden"]
["Lingemeer","Lingewaard",null,"Label C","Label B",0.24,72,109,16,6,1,5,9,242,"1997 tot 2000",0.43,28,17,20,16,8,39,196,94,19,12,11,1270,168910,"Gebied is in onderzoek met wachtrij","Midden"]
["Lintelo","Aalten",null,"Label E","Label C",0.06,10,6,18,10,12,14,12,223,"Voor 1930",0.43,132,31,33,25,42,7,6,4,7,12,6,1640,85290,"Gebied is in onderzoek met wachtrij","Laag"]
["Lobith","Zevenaar",null,"Label C","Label A en beter",0.16,476,369,290,231,97,82,74,1274,"1976 tot 1992",0.25,420,92,389,347,727,244,74,301,263,3,33,1078,613181,"Gebied is in onderzoek met wachtrij","Hoog"]
["Loenen (Gld.)","Apeldoorn",null,"Label D","Label A en beter",0.15,200,142,169,78,58,45,52,555,"1946 tot 1965",0.2,235,92,264,218,199,48,9,87,14,13,120,1374,453351,"Transportcapaciteit beperkt beschikbaar zonder wachtrij","Middelhoog"]
["Loo (Gld. bij Duiven)","Duiven",null,"Label C","Label A en beter",0.17,74,26,41,8,22,15,14,235,"1976 tot 1992",0.24,53,31,80,42,105,13,12,15,51,18,15,1300,185900,"Gebied is in onderzoek met wachtrij","Midden"]
["Lunteren-De Stroet","Ede",null,"Label D","Label A en beter",0.1,40,15,23,9,8,6,17,277,"Voor 1930",0.17,66,63,63,36,54,12,8,33,24,4,32,1830,777750,"Tekort aan transportcapaciteit met wachtrij","Hoog"]
["Lunteren-Goudsberg","Ede",null,"Label D","Label A en beter",0.08,13,4,7,5,3,1,8,114,"1976 tot 1992",0.25,13,19,14,17,39,2,8,27,12,1,3,2050,299300,"Transportcapaciteit beperkt beschikbaar zonder wachtrij","Middelhoog"]
["Maasbommel","West Maas en Waal",null,"Label C","Label A en beter",0.18,91,45,35,26,11,20,22,250,"Voor 1930",0.22,109,16,67,92,100,30,37,19,6,17,7,1402,231369,"Gebied is in onderzoek met wachtrij","Midden"]
["Maasbommel-Heerstraat","West Maas en Waal",null,"Label E","Label G",0.09,12,6,10,11,6,12,16,108,"Voor 1930",0.45,81,9,26,16,11,7,14,9,3,1,4,1540,138600,"Gebied is in onderzoek met wachtrij","Middellaag"]
["Mariënvelde","Oost Gelre",null,"Label D","Label A en beter",0.09,32,9,30,10,10,6,14,248,"1946 tot 1965",0.18,40,42,63,63,60,10,11,34,20,6,10,1348,113249,"Transportcapaciteit beperkt beschikbaar zonder wachtrij","Middellaag"]
["Meddo","Winterswijk",null,"Label D","Label A en beter",0.09,39,8,27,11,11,11,25,314,"Voor 1930",0.35,158,43,44,41,59,29,17,9,12,26,8,1550,139465,"Transportcapaciteit beperkt beschikbaar zonder wachtrij","Middellaag"]
["Megchelen","Oude IJsselstreek",null,"Label D","Label C",0.14000000000000001,23,26,52,13,12,13,10,236,"1976 tot 1992",0.22,72,15,83,54,86,11,15,22,7,10,10,1574,166817,"Transportcapaciteit beschikbaar zonder wachtrij","Midden"]
["Miste","Winterswijk",null,"Label E","Label G",0.08,11,5,7,12,3,8,16,130,"Voor 1930",0.44,85,23,14,25,10,3,3,11,13,0,5,1546,57198,"Transportcapaciteit beperkt beschikbaar zonder wachtrij","Laag"]
["Nederasselt","Heumen",null,"Label C","Label A en beter",0.2,61,18,23,20,12,7,7,151,"1976 tot 1992",0.21,40,10,26,60,62,25,18,6,33,9,10,1317,146136,"Tekort aan transportcapaciteit met wachtrij","Middellaag"]
["Nederhemert-Noord","Zaltbommel",null,"Label D","Label A en beter",0.1,64,35,48,26,20,18,22,389,"1976 tot 1992",0.2,97,25,113,78,122,31,11,29,10,25,81,1380,264887,"Gebied is in onderzoek met wachtrij","Middelhoog"]
["Nederhemert-Noord-Veerweg","Zaltbommel",null,"Label D","Label C",0.09,40,30,41,21,12,15,19,258,"1976 tot 1992",0.24,83,18,93,60,103,27,5,18,8,3,18,1360,240720,"Gebied is in onderzoek met wachtrij","Midden"]
["Neerijnen","West Betuwe",null,"Label E","Label G",0.08,8,2,10,3,2,4,12,118,"Voor 1930",0.36,57,15,26,13,19,7,6,6,5,2,3,1709,153850,"Gebied is in onderzoek met wachtrij","Midden"]
["Netterden","Oude IJsselstreek",null,"Label D","Label A en beter",0.1,22,11,21,15,2,3,7,144,"Voor 1930",0.2,44,14,23,33,43,18,14,7,8,4,17,1453,88653,"Transportcapaciteit beschikbaar zonder wachtrij","Laag"]
["Nieuwaal","Zaltbommel",null,"Label C","Label A en beter",0.19,75,20,39,20,16,7,11,201,"2015 tot 2020",0.18,55,13,36,64,61,20,12,20,20,19,69,1360,141465,"Tekort aan transportcapaciteit met wachtrij","Middellaag"]
["Nieuw-Dijk","Montferland",null,"Label C","Label A en beter",0.16,105,44,52,16,16,17,18,375,"1946 tot 1965",0.23,49,73,147,98,115,26,40,16,27,14,38,1425,342000,"Tekort aan transportcapaciteit met wachtrij","Middelhoog"]
["Nieuw-Wehl","Doetinchem",null,"Label D","Label A en beter",0.1,40,8,35,16,7,3,7,290,"1976 tot 1992",0.18,37,41,60,55,75,27,14,28,36,5,28,1572,183895,"Gebied is in onderzoek met wachtrij","Midden"]
["Niftrik","Wijchen",null,"Label D","Label A en beter",0.15,22,7,12,4,8,2,9,78,"1946 tot 1965",0.18,10,20,25,18,22,13,5,12,13,2,2,1564,159573,"Tekort aan transportcapaciteit met wachtrij","Midden"]
["Nijbroek","Voorst",null,"Label D","Label C",7.0000000000000007E-2,21,12,25,11,4,11,17,243,"Voor 1930",0.44,150,46,32,15,51,5,7,11,5,12,10,1628,63487,"Tekort aan transportcapaciteit met wachtrij","Laag"]
["Nijkerkerveen","Nijkerk",null,"Label C","Label A en beter",0.22,317,147,190,46,32,25,46,640,"1976 tot 1992",0.21,97,128,262,138,299,100,72,67,40,25,215,1275,497112,"Gebied is in onderzoek met wachtrij","Middelhoog"]
["Noordijk","Berkelland",null,"Label E","Label C",0.05,16,9,17,17,3,11,16,234,"Voor 1930",0.28999999999999998,95,31,50,24,53,15,9,18,13,3,12,1670,106898,"Transportcapaciteit beperkt beschikbaar zonder wachtrij","Middellaag"]
["Nunspeet-Klein Rhijnvis","Nunspeet",null,"Label C","Label A en beter",0.1,32,8,15,8,3,5,8,236,"1930 tot 1945",0.18,44,57,44,15,33,8,28,19,17,24,26,1498,431336,"Tekort aan transportcapaciteit met wachtrij","Middelhoog"]
["Oene","Epe",null,"Label D","Label A en beter",0.16,98,22,52,24,21,19,27,366,"Voor 1930",0.27,171,60,81,59,104,4,25,27,26,30,42,1524,214909,"Transportcapaciteit beperkt beschikbaar zonder wachtrij","Midden"]
["Olburgen","Bronckhorst",null,"Label E","Label E",7.0000000000000007E-2,7,5,6,3,8,5,5,73,"1976 tot 1992",0.25,25,10,17,4,28,0,10,8,6,3,1,1433,118927,"Transportcapaciteit beperkt beschikbaar zonder wachtrij","Middellaag"]
["Oldebroek-Noord","Oldebroek",null,"Label F","Label G",0.12,16,7,10,19,10,10,37,202,"Voor 1930",0.4,124,60,39,17,6,2,12,23,5,6,17,1560,209040,"Tekort aan transportcapaciteit met wachtrij","Midden"]
["Ommeren","Buren",null,"Label D","Label C",0.1,8,7,16,8,6,3,8,111,"1946 tot 1965",0.26,23,13,43,20,22,29,6,7,1,0,3,1600,171200,"Tekort aan transportcapaciteit met wachtrij","Midden"]
["Ooij (Gld.)","Berg en Dal",null,"Label C","Label A en beter",0.26,304,108,152,48,30,25,15,468,"1966 tot 1975",0.26,93,60,231,297,117,66,70,85,5,44,82,1073,346647,"Gebied is in onderzoek met wachtrij","Middelhoog"]
["Oosterhuizen","Apeldoorn",null,"Label D","Label A en beter",0.05,10,5,10,4,5,6,8,134,"Voor 1930",0.42,77,25,17,27,10,3,2,1,13,2,5,1840,88320,"Gebied is in onderzoek met wachtrij","Laag"]
["Oosterwolde (Gld.)","Oldebroek",null,"Label C","Label A en beter",0.19,64,30,19,22,8,6,17,168,"1976 tot 1992",0.16,48,15,45,30,53,16,13,41,47,13,13,1200,186000,"Tekort aan transportcapaciteit met wachtrij","Midden"]
["Ophemert","West Betuwe",null,"Label D","Label A en beter",0.11,77,46,75,52,17,27,26,368,"1966 tot 1975",0.2,128,33,95,136,125,27,80,19,19,19,7,1454,244224,"Gebied is in onderzoek met wachtrij","Midden"]
["Opijnen","West Betuwe",null,"Label C","Label A en beter",0.19,89,39,58,19,11,10,18,227,"1976 tot 1992",0.28000000000000003,65,18,51,80,134,4,6,95,6,1,11,1298,195950,"Gebied is in onderzoek met wachtrij","Midden"]
["Otterlo","Ede",null,"Label D","Label C",0.12,76,68,122,58,19,17,33,604,"1976 tot 1992",0.31,69,48,188,149,312,90,25,32,31,6,47,1544,481773,"Tekort aan transportcapaciteit met wachtrij","Middelhoog"]
["Otterlo-Noord","Ede",null,"Label D","Label C",0.12,76,68,122,58,19,17,33,604,"1976 tot 1992",0.31,69,48,188,149,312,90,25,32,31,6,47,1544,315005,"Gebied is in onderzoek met wachtrij","Middelhoog"]
["Oud Zevenaar","Zevenaar",null,"Label C","Label A en beter",0.19,51,19,17,16,8,6,11,147,"1966 tot 1975",0.3,33,34,34,83,14,1,47,2,23,0,4,1380,248400,"Gebied is in onderzoek met wachtrij","Midden"]
["Overasselt","Heumen",null,"Label C","Label A en beter",0.15,146,121,117,42,24,21,15,485,"1976 tot 1992",0.27,78,23,129,186,259,40,103,63,32,29,29,1314,394230,"Gebied is in onderzoek met wachtrij","Middelhoog"]
["Pannerden","Zevenaar",null,"Label D","Label C",0.19,101,110,197,55,25,22,20,484,"1976 tot 1992",0.32,111,25,124,171,322,26,90,47,60,2,36,1154,357657,"Gebied is in onderzoek met wachtrij","Middelhoog"]
["Poederoijen","Zaltbommel",null,"Label C","Label A en beter",0.16,54,17,19,19,12,5,10,200,"Voor 1930",0.18,62,16,58,26,57,18,24,18,5,6,46,1393,183821,"Transportcapaciteit beperkt beschikbaar zonder wachtrij","Midden"]
["Randwijk","Neder-Betuwe",null,"Label D","Label C",0.18,37,45,88,34,22,13,15,225,"1946 tot 1965",0.27,73,39,128,68,40,6,85,16,4,4,16,1333,194556,"Gebied is in onderzoek met wachtrij","Midden"]
["Ravenswaaij","Buren",null,"Label D","Label A en beter",0.09,16,6,9,7,1,6,7,128,"Voor 1930",0.28999999999999998,52,18,24,21,16,12,4,2,4,0,27,1342,77836,"Gebied is in onderzoek met wachtrij","Laag"]
["Rekken","Berkelland",null,"Label D","Label C",0.1,28,14,51,8,9,9,22,371,"1976 tot 1992",0.23,108,78,80,45,118,31,23,10,10,0,9,1507,108520,"Gebied is in onderzoek met wachtrij","Middellaag"]
["Rhenoy","West Betuwe",null,"Label C","Label A en beter",0.24,88,22,32,19,6,13,9,175,"2015 tot 2020",0.22,60,18,46,70,59,4,2,10,13,2,80,1247,182073,"Tekort aan transportcapaciteit met wachtrij","Midden"]
["Rietmolen","Berkelland",null,"Label D","Label C",0.08,27,20,32,10,9,10,10,278,"1966 tot 1975",0.19,48,39,60,77,75,26,29,10,11,6,15,1508,149275,"Transportcapaciteit beschikbaar zonder wachtrij","Middellaag"]
["Rijswijk (Gld.)","Buren",null,"Label D","Label C",7.0000000000000007E-2,13,10,17,7,10,2,11,164,"Voor 1930",0.25,59,14,42,45,43,22,2,1,6,0,0,1508,99510,"Tekort aan transportcapaciteit met wachtrij","Laag"]
["Rossum (Gld.)","Maasdriel",null,"Label D","Label A en beter",0.16,183,89,165,58,24,21,24,583,"1976 tot 1992",0.3,116,90,158,161,345,46,108,22,89,5,7,1298,420525,"Transportcapaciteit beperkt beschikbaar zonder wachtrij","Middelhoog"]
["Rumpt (Gld.)","West Betuwe",null,"Label D","Label C",0.12,27,20,59,29,18,17,21,291,"Voor 1930",0.3,143,32,82,85,87,13,6,6,19,3,6,1631,415871,"Gebied is in onderzoek met wachtrij","Middelhoog"]
["Sinderen","Oude IJsselstreek",null,"Label E","Label G",0.09,37,21,23,22,14,22,53,387,"Voor 1930",0.45,262,71,80,41,56,22,4,12,8,8,15,1688,81023,"Gebied is in onderzoek met wachtrij","Laag"]
["Slijk-Ewijk","Overbetuwe",null,"Label F","Label G",0.08,13,4,6,6,9,9,15,128,"Voor 1930",0.27,52,18,33,48,11,9,5,5,4,1,4,1552,97770,"Gebied is in onderzoek met wachtrij","Laag"]
["Sonnevanck","Nunspeet",null,"Label C","Label A en beter",0.17,14,14,5,4,3,1,1,41,"1997 tot 2000",0.28999999999999998,8,13,17,2,2,0,24,15,0,2,0,1819,36374,"Transportcapaciteit beperkt beschikbaar zonder wachtrij","Laag"]
["Spijk (Gld. bij Gorinchem)","West Betuwe",null,"Label D","Label A en beter",0.12,44,33,37,16,11,8,26,204,"1966 tot 1975",0.21,73,49,30,79,41,22,25,25,6,5,24,1320,170280,"Tekort aan transportcapaciteit met wachtrij","Midden"]
["Spijk (Gld. bij Lobith)","Zevenaar",null,"Label D","Label C",0.18,24,23,59,22,23,14,7,148,"1946 tot 1965",0.51,37,10,164,26,34,14,11,14,6,0,4,1222,105071,"Gebied is in onderzoek met wachtrij","Middellaag"]
["Steenderen","Bronckhorst",null,"Label D","Label C",0.18,83,134,180,47,26,25,19,477,"1976 tot 1992",0.28999999999999998,129,37,100,168,289,102,65,70,22,5,4,1311,380234,"Gebied is in onderzoek met wachtrij","Middelhoog"]
["Stokkum","Montferland",null,"Label D","Label C",0.09,39,20,44,30,12,13,20,294,"1976 tot 1992",0.19,64,60,84,72,92,14,9,26,23,13,15,1367,231096,"Tekort aan transportcapaciteit met wachtrij","Midden"]
["Stroe","Barneveld",null,"Label C","Label A en beter",0.15,90,40,58,29,4,11,13,340,"1946 tot 1965",0.24,41,39,142,53,94,40,27,31,53,4,61,1429,254281,"Transportcapaciteit beperkt beschikbaar zonder wachtrij","Middelhoog"]
["'t Loo","Oldebroek",null,"Label C","Label A en beter",0.15,70,27,22,16,11,18,22,279,"1946 tot 1965",0.31,33,36,146,51,54,13,27,25,61,8,11,1421,321204,"Gebied is in onderzoek met wachtrij","Middelhoog"]
["Terschuur","Barneveld",null,"Label D","Label C",0.13,51,37,73,24,12,16,16,318,"1946 tot 1965",0.19,77,49,105,72,99,3,49,36,33,7,17,1557,200816,"Gebied is in onderzoek met wachtrij","Midden"]
["Terwolde","Voorst",null,"Label D","Label C",0.1,64,60,79,38,19,22,36,449,"Voor 1930",0.26,202,92,105,42,164,20,22,72,32,6,10,1415,223567,"Gebied is in onderzoek met wachtrij","Midden"]
["Terwolde-De Scherpenhof","Voorst",null,"Label E","Label G",0.06,14,9,10,6,4,8,17,228,"Voor 1930",0.36,107,29,27,10,60,7,12,31,7,2,4,1550,206150,"Gebied is in onderzoek met wachtrij","Midden"]
["Teuge","Voorst",null,"Label D","Label A en beter",0.12,41,14,24,15,12,6,13,228,"Voor 1930",0.24,85,34,56,42,55,9,5,13,22,3,29,1521,159731,"Gebied is in onderzoek met wachtrij","Midden"]
["Toldijk (Gld.)","Bronckhorst",null,"Label D","Label C",0.11,13,14,40,14,11,13,25,232,"Voor 1930",0.31,111,32,73,44,48,22,7,8,6,5,6,1583,118688,"Tekort aan transportcapaciteit met wachtrij","Middellaag"]
["Tolkamer","Zevenaar",null,"Label C","Label A en beter",0.19,255,155,108,25,32,36,49,694,"1976 tot 1992",0.25,306,29,84,15,332,185,42,165,189,0,7,1056,518365,"Gebied is in onderzoek met wachtrij","Hoog"]
["Tricht","West Betuwe",null,"Label D","Label A en beter",0.17,183,87,128,66,29,38,32,525,"1966 tot 1975",0.24,185,90,153,261,157,91,11,19,16,4,101,1313,442320,"Tekort aan transportcapaciteit met wachtrij","Middelhoog"]
["Uddel","Apeldoorn",null,"Label C","Label A en beter",0.26,254,73,57,42,30,27,34,477,"2015 tot 2020",0.2,93,92,109,96,130,35,104,33,84,24,194,1396,379596,"Transportcapaciteit beperkt beschikbaar zonder wachtrij","Middelhoog"]
["Valburg","Overbetuwe",null,"Label C","Label A en beter",0.19,145,73,64,36,24,24,21,382,"1976 tot 1992",0.21,97,39,92,81,164,12,134,31,7,92,20,1268,309344,"Gebied is in onderzoek met wachtrij","Middelhoog"]
["Varik","West Betuwe",null,"Label D","Label A en beter",0.18,79,25,43,22,12,17,16,233,"1976 tot 1992",0.24,95,21,70,27,109,11,4,39,23,3,45,1387,190050,"Tekort aan transportcapaciteit met wachtrij","Midden"]
["Varsselder","Oude IJsselstreek",null,"Label D","Label A en beter",0.1,42,36,41,13,11,10,17,244,"1966 tot 1975",0.21,56,13,44,86,86,13,55,39,4,4,14,1405,486298,"Transportcapaciteit beschikbaar zonder wachtrij","Middelhoog"]
["Veessen","Heerde",null,"Label D","Label A en beter",0.13,26,22,14,8,10,6,14,93,"Voor 1930",0.32,61,21,19,20,39,3,1,22,4,1,2,1380,122820,"Gebied is in onderzoek met wachtrij","Middellaag"]
["Velddriel","Maasdriel",null,"Label B","Label A en beter",0.28999999999999998,262,42,52,25,18,17,23,454,"2015 tot 2020",0.24,33,100,120,94,145,29,50,26,35,49,212,1419,310697,"Tekort aan transportcapaciteit met wachtrij","Middelhoog"]
["Veldhoek","Bronckhorst",null,"Label C","Label A en beter",0.17,10,3,5,2,1,1,2,35,"1946 tot 1965",0.27,0,7,16,7,14,2,3,0,9,0,1,1320,51480,"Tekort aan transportcapaciteit met wachtrij","Laag"]
["Velswijk","Bronckhorst",null,"Label D","Label C",0.09,26,25,42,29,9,11,15,299,"Voor 1930",0.24,111,37,77,70,86,11,17,10,15,4,18,1536,125926,"Tekort aan transportcapaciteit met wachtrij","Middellaag"]
["Vierhouten","Nunspeet",null,"Label D","Label C",0.12,25,25,33,8,2,11,15,163,"1976 tot 1992",0.2,21,38,56,48,57,12,8,20,13,2,7,1767,157304,"Tekort aan transportcapaciteit met wachtrij","Midden"]
["Voorst (Gld.)","Oude IJsselstreek",null,"Label D","Label C",0.15,78,72,127,39,25,30,33,462,"Voor 1930",0.24,205,44,115,187,174,26,8,43,41,8,15,1292,354097,"Transportcapaciteit beperkt beschikbaar zonder wachtrij","Middelhoog"]
["Vragender","Oost Gelre",null,"Label D","Label A en beter",7.0000000000000007E-2,30,14,25,11,10,12,10,301,"Voor 1930",0.2,82,47,78,51,67,29,6,15,15,1,22,1520,132265,"Gebied is in onderzoek met wachtrij","Middellaag"]
["Vuren","West Betuwe",null,"Label D","Label C",0.24,115,77,195,60,13,13,6,333,"1966 tot 1975",0.34,27,15,116,273,172,11,34,73,19,43,29,1020,263160,"Gebied is in onderzoek met wachtrij","Middelhoog"]
["Waardenburg/Tuil","West Betuwe",null,"Label B","Label A en beter",0.32,386,108,70,42,26,42,28,521,"1946 tot 1965",0.17,155,43,214,176,206,32,176,15,18,79,109,1284,354387,"Tekort aan transportcapaciteit met wachtrij","Middelhoog"]
["Wadenoijen","Tiel",null,"Label D","Label C",0.09,20,21,26,10,7,4,7,184,"1966 tot 1975",0.31,40,2,63,86,30,3,21,0,31,0,3,1300,198900,"Gebied is in onderzoek met wachtrij","Midden"]
["Wamel","West Maas en Waal",null,"Label D","Label A en beter",0.15,148,65,131,47,31,33,40,516,"1976 tot 1992",0.23,188,38,123,171,237,28,64,38,78,19,27,1275,337904,"Tekort aan transportcapaciteit met wachtrij","Middelhoog"]
["Wapenveld-Noord","Heerde",null,"Label E","Label C",0.12,11,5,26,12,14,12,18,114,"1930 tot 1945",0.25,47,54,42,22,28,4,4,3,4,3,1,1990,165170,"Gebied is in onderzoek met wachtrij","Midden"]
["Wekerom","Ede",null,"Label C","Label A en beter",0.19,158,53,89,33,23,14,23,452,"2015 tot 2020",0.23,57,67,118,143,153,12,22,30,24,22,197,1316,309260,"Gebied is in onderzoek met wachtrij","Middelhoog"]
["Well (Gld.)","Maasdriel",null,"Label C","Label A en beter",0.21,64,25,31,10,7,6,8,151,"1946 tot 1965",0.22,28,11,67,31,60,13,24,16,24,20,8,1296,242395,"Tekort aan transportcapaciteit met wachtrij","Midden"]
["Westendorp (Gld.)","Oude Ijsselstreek",null,"Label D","Label C",0.09,27,8,34,14,10,5,25,244,"Voor 1930",0.28000000000000003,103,41,63,37,71,2,18,5,12,2,13,1587,144437,"Tekort aan transportcapaciteit met wachtrij","Middellaag"]
["Wichmond","Bronckhorst",null,"Label D","Label A en beter",0.08,66,48,59,25,11,19,36,587,"Voor 1930",0.39,328,72,67,101,106,24,34,62,36,8,13,1567,139460,"Gebied is in onderzoek met wachtrij","Middellaag"]
["Wijchen-Wighenerhorst","Wijchen",null,"Label B","Label A en beter",0.25,54,11,12,5,2,3,4,125,"2001 tot 2006",0.25,27,12,19,14,16,4,4,55,4,16,45,1460,113880,"Tekort aan transportcapaciteit met wachtrij","Middellaag"]
["Wijnbergen","Montferland",null,"Label B","Label A en beter",0.78,332,3,5,2,1,2,5,75,"2015 tot 2020",0.65,5,23,7,5,15,0,0,2,1,91,276,923,653364,"Tekort aan transportcapaciteit met wachtrij","Hoog"]
["Wilp","Voorst",null,"Label D","Label A en beter",0.14000000000000001,82,30,69,49,18,18,24,289,"Voor 1930",0.21,119,53,68,71,94,23,30,14,10,67,30,1304,200805,"Gebied is in onderzoek met wachtrij","Midden"]
["Wilp-Achterhoek","Voorst",null,"Label E","Label D",0.05,7,6,7,9,6,8,5,127,"Voor 1930",0.26,46,18,34,12,18,8,16,6,9,6,2,1602,73691,"Gebied is in onderzoek met wachtrij","Laag"]
["Winssen","Beuningen",null,"Label D","Label C",0.12,90,60,109,33,21,23,33,539,"1976 tot 1992",0.21,144,43,141,179,189,120,6,25,15,10,36,1352,356929,"Tekort aan transportcapaciteit met wachtrij","Middelhoog"]
["Wissel","Epe",null,"Label E","Label C",0.08,27,14,28,16,12,19,26,216,"1946 tot 1965",0.21,65,65,74,43,48,8,5,19,7,10,14,1740,549840,"Transportcapaciteit beperkt beschikbaar zonder wachtrij","Hoog"]
["Wolbert","Heerde",null,"Label E","Label C",0.09,34,10,41,22,12,14,40,277,"Voor 1930",0.26,116,71,65,43,58,14,10,27,17,4,25,1470,348390,"Gebied is in onderzoek met wachtrij","Middelhoog"]
["Wolfheze","Renkum",null,"Label D","Label A en beter",0.15,100,22,59,37,26,27,16,394,"1946 tot 1965",0.43,65,57,294,103,92,0,2,12,3,0,53,1315,263016,"Tekort aan transportcapaciteit met wachtrij","Middelhoog"]
["Woold","Winterswijk",null,"Label E","Label G",0.08,13,9,15,11,6,11,28,249,"Voor 1930",0.57999999999999996,199,46,29,20,25,5,6,6,3,1,2,1727,50084,"Transportcapaciteit beperkt beschikbaar zonder wachtrij","Laag"]
["Zeddam","Montferland",null,"Label D","Label A en beter",0.13,196,123,135,74,46,41,45,806,"1946 tot 1965",0.2,141,110,294,242,251,117,43,69,78,47,74,1330,506819,"Tekort aan transportcapaciteit met wachtrij","Hoog"]
["Zetten-Zuid","Overbetuwe",null,"Label D","Label C",0.36,47,57,147,9,6,9,4,132,"1976 tot 1992",0.55000000000000004,22,37,13,74,225,11,22,7,0,0,0,1161,514417,"Gebied is in onderzoek met wachtrij","Hoog"]
["Zieuwent","Oost Gelre",null,"Label D","Label C",0.1,63,61,78,31,14,17,39,506,"1976 tot 1992",0.25,138,50,119,96,201,70,60,36,14,18,7,1417,259382,"Tekort aan transportcapaciteit met wachtrij","Middelhoog"]
["Zoelen","Buren",null,"Label D","Label A en beter",0.15,96,34,66,40,16,16,23,344,"Voor 1930",0.27,172,19,73,150,52,41,2,20,41,7,58,1443,229413,"Transportcapaciteit beperkt beschikbaar zonder wachtrij","Midden"]
["Zoelmond","Buren",null,"Label D","Label A en beter",0.15,68,25,43,28,14,8,13,251,"Voor 1930",0.23,102,34,65,79,42,15,5,43,9,3,53,1437,150875,"Gebied is in onderzoek met wachtrij","Midden"]
["Zuilichem","Zaltbommel",null,"Label C","Label A en beter",0.21,128,41,63,26,15,16,21,295,"1976 tot 1992",0.21,70,17,87,104,127,29,36,26,20,3,86,1200,225626,"Transportcapaciteit beperkt beschikbaar zonder wachtrij","Midden"]
["Zuuk","Epe",null,"Label E","Label G",0.09,27,7,33,26,14,22,44,338,"Voor 1930",0.27,139,92,81,44,55,8,47,16,9,5,15,1730,204140,"Transportcapaciteit beperkt beschikbaar zonder wachtrij","Midden"]
["Zwartebroek","Barneveld",null,"Label B","Label A en beter",0.23,123,35,53,8,5,10,8,298,"1976 tot 1992",0.21,43,38,85,55,115,37,21,41,6,2,97,1285,204276,"Gebied is in onderzoek met wachtrij","Midden"]

{"sheet":"Toelichting","index":10,"n_rows":20,"n_cols":2,"rows_kept":20,"cut":false,"hidden":true,"merged":[]}
["Kop","Uitleg"]
["Warmtebron","De bron van de warmte, zoals geothermie, asfaltthermie, aquathermie etc."]
["Type net","Het type warmtenet of individueel systeem dat wordt gebruikt.\n\nEen bronnet is een collectief systeem waarbij lage temperatuur warmte (bijvoorbeeld uit bodem, oppervlaktewater of restwarmte) via een netwerk wordt verdeeld. In de woningen wordt deze warmte lokaal opgewaardeerd naar de gewenste temperatuur met behulp van individuele warmtepompen. Dit systeem is efficiënt en flexibel, en maakt het mogelijk om zowel ruimteverwarming als tapwaterverwarming te verzorgen, waarbij de warmtepomp in de woning zorgt voor de juiste temperatuur per toepassing.\n\nEen warmtenet is altijd collectief en levert warmte op een vooraf bepaalde temperatuur (bijvoorbeeld 70°C of 90°C) rechtstreeks aan de woningen. De warmte wordt opgewekt door een centrale installatie, zoals een grote warmtepomp, biomassacentrale of WKK. De geleverde temperatuur is doorgaans hoog genoeg voor zowel ruimteverwarming als tapwaterverwarming, waardoor er in de woning geen individuele opwaardering nodig is."]
["Opwaardering","Bij centrale opwaardering wordt de warmte in een centrale installatie – zoals een grote warmtepomp of biomassacentrale – op een hoge temperatuur gebracht. Deze warmte wordt vervolgens via het warmtenet direct geleverd aan de woningen, waar het geschikt is voor zowel ruimteverwarming als tapwaterverwarming zonder verdere opwaardering in huis.\n\nBij decentrale opwaardering wordt lage temperatuur warmte via een bronnet naar de woningen gebracht. In de woning zelf zorgt een individuele warmtepomp voor het opwaarderen van de temperatuur. Deze warmtepomp verhoogt de temperatuur afhankelijk van de toepassing: lager voor ruimteverwarming (bijv. 35–55°C) en hoger voor tapwaterverwarming (minimaal 60°C om legionella te voorkomen)."]
["PBL startanalyse code","De PBL Startanalyse code is gerelateerd aan verschillende warmtesystemen door het bieden van een gedetailleerde evaluatie van de kosten en technische mogelijkheden voor het verwarmen van gebouwen zonder aardgas. De Actualisatie Startanalyse Aardgasvrije Buurten 2025 (ASA2025) bevat informatie over vier strategieën om gebouwen te verwarmen:\n1. All-electric: Dit systeem maakt gebruik van elektrische warmtepompen om gebouwen te verwarmen. De Startanalyse code helpt bij het bepalen van de kosten en efficiëntie van deze technologie in verschillende buurten.\n2. Hybride warmtepompen: Deze systemen combineren een elektrische warmtepomp met een gasgestookte ketel voor piekbelasting. De code biedt inzicht in de meerkosten en technische haalbaarheid van deze optie.\n3. Warmtenetten: Dit systeem maakt gebruik van een centraal verwarmingssysteem dat warmte distribueert naar meerdere gebouwen. De Startanalyse code helpt bij het evalueren van de infrastructuurkosten en de potentie van lokale warmtebronnen.\n4. Groen gas: Dit systeem vervangt aardgas door duurzaam geproduceerd gas. De code analyseert de beschikbaarheid en kosten van groen gas voor verwarming.\nDeze strategieën worden in de Startanalyse code gedetailleerd geëvalueerd om gemeenten te ondersteunen bij het maken van geïnformeerde keuzes voor hun warmteprogramma's"]
["Bron temperatuur","De temperatuur van de warmtebron in graden Celsisus. Dit is de temperatuur die de bron levert aan het systeem. Hierna is eventueel nog opwaardering nodig om naar de juiste aflevertemperatuur te gaan"]
["Aflevertemperatuur","Het type systeem dat wordt toegepast voor verwarming: \n1. Zeer laagtemperatuur (ZLT) < 25 graden Celsius\n2. Laagtemperatuur (LT) 25-40 graden Celsius\n3. Middentemperatuur (MT) 40 - 75 graden Celsius\n4. Hoogtemperatuur (HT) > 75 graden Celsius"]
["Uitkomst","Uitleg over hoe het beoogde systeem eruit ziet"]
["Energielabel","Deze kolom geeft aan tot welk niveau energielabel het huis moet worden aangepast om geschikt te zijn op het type warmtesysteem."]
["Piekvoorziening nodig?","Het warmtesysteem bestaat uit basislast en pieklast. De basislastvoorziening voorziet in het grootste gedeelte van de warmte. De pieklast voorziening voorziet van warmte alleen op de koudste momenten. Bij een individueel of bronnetsysteem, waarbij warmtepompen per woning geplaatst worden, dient deze warmtepomp tevens ook als pieklastvoorziening. Er is geen extra pieklastvoorziening nodig. In het geval van een warmtenet is het afhankelijk van de soort warmtebron of er een extra pieklastvoorziening nodig is, vaak is dit wel het geval."]
["Dichtheid bebouwing","Definitie: Dit verwijst naar het aantal gebouwen per vierkante kilometer in een bepaald gebied.\n\nToepassing: Het helpt bij het bepalen van de geschiktheid van een warmtesysteem voor een specifieke omgeving. Bijvoorbeeld, systemen zoals diepe geothermie en biogas zijn beter geschikt voor gebieden met een hoge dichtheid van bebouwing, terwijl lucht/water warmtepompen beter werken in gebieden met een lage dichtheid.\n1. Lage dichtheid: Dit verwijst naar gebieden met weinig gebouwen per vierkante kilometer. Voorbeelden zijn landelijke gebieden of buitenwijken met vrijstaande huizen en veel open ruimte.\n2. Middelhoge dichtheid: Dit verwijst naar gebieden met een gematigd aantal gebouwen per vierkante kilometer. Voorbeelden zijn voorstedelijke gebieden met rijtjeshuizen, appartementencomplexen en gemengde woon-werkgebieden.\n3. Hoge dichtheid: Dit verwijst naar gebieden met veel gebouwen per vierkante kilometer. Voorbeelden zijn stedelijke gebieden met hoogbouw, appartementencomplexen en commerciële gebouwen dicht bij elkaar.\n"]
["Schaalgrootte","De schaalgrootte van de kern voor het warmtenet:\n- 1 = individueel\n- Klein = tot 200\n- Middel = tot 500\n- Middelgroot = 500 tot 1500\n- Groot = tot 1500\n- Zeer groot = tot 5000"]
["Netcongestie","De mate van belasting op het elektriciteitsnet. Het betreft een score van 1 tot en met 6, waarbij 6 de referentie is van een individuele lucht warmtepomp. Elke systeem is gescoord naar mate de piekbelasting; oe hoger hoe minder vraag naar piekvraag naar elektriciteit, wat de kans op netcongestie verminderd. Technieken met opslag scoren iets positiever, tenzij de warmte eerst verlaagd moet worden om opgeslagen te worden, dan scoren de technieken juist weer wat hoger"]
["Nabijheid van bron (t.b.v. water, restwarmte)","Geeft aan of de nabijheid van de bron belangrijk is voor het warmtesysteem; zon voor PVT is altijd aanwezig, die hoeft niet dichterbij te staan. Echter aquathermie systemen moeten wel een waterbron in de buurt hebben voor een rendabel systeem"]
["Beperkingen omgeving Natura2000","Er is een beperking in de omgeving van natura2000 gebieden wanneer gas gebruikt wordt. Dit koomt door stikstofuitstoot, wat niet toegestaan is nabij natura2000 gebieden"]
["Beperkingen omgeving  waterwinning","Eventuele beperkingen in de omgeving, zoals waterwingebieden. Dit is van toepassing wanneer een systeem gebruikt maakt van grondboringen"]
["Samenwerking?","Geeft aan of bij een systeem de omvang groter is dan het afzetgebied; dan is samenwerking tussen gemeenten nodig of noodzakelijk. Indien dit niet zo is, dan is het systeem lokaal mogelijk (binnen 1 gemeente)"]
["Type kern","Hier wordt gespecificeerd wat voor type kern het beste past bij de techniek:\n- Verspreide bebouwing\n- Kleine dorpen\n- Middelgrote dorpen\n- Grote dorpen"]
["Type woning voorkeur","Geeft aan met welke type woning eerst begonnen moet worden voor een warmtesysteem. Hoogbouw is makkelijker aan te sluiten dan vrijstaande huizen en resulteerd in een grotere warmteafzet"]
["Energiearmoede verergerd?","Geeft aan of het ssteem bijdraagt aan energiearmeode. Alle individuele systemen staan op ja en warmte- en bronnetten staan op nee. Dit komt doordat bij deze systemen een maximaal ACM-tarief is bepaald en wordt ook pas gerealiseerd wanneer er een rendabele businesscase mogelijk is. Terwijl bij individuele systemen de huishoudens dit zelf kunnen aanschaffen, maar het vereist een grote investering, waardoor huishoudens met een lager inkomen dit niet kunnen betalen."]